title: ChemShell job
elementType: c
basis: def2-mSVP
elementType: n
elementType: h
elementType: s
elementType: li
method: uhf
method: dft
functional: pbeh-3c
elementType: c n h s li
basis: def2-mSVP def2-mSVP def2-mSVP def2-mSVP def2-mSVP
frequency: -0.00 0.0000 0.0000 0.0000 0.0000 0.0000 30.23 32.88 59.80 73.47 77.79 87.94 90.95 97.00 104.84 113.18 119.65 123.72 130.16 140.16 156.71 169.90 188.58 190.31 199.89 204.33 210.85 213.00 218.12 223.19 238.39 240.57 246.46 256.05 272.05 287.62 302.84 309.80 315.13 324.01 326.65 347.80 350.16 381.62 390.94 397.19 401.87 408.06 418.93 422.70 424.80 433.40 457.64 474.70 488.25 492.67 504.17 510.43 520.67 526.78 529.86 553.01 557.09 570.01 575.13 616.61 638.51 656.67 666.20 669.32 699.33 737.04 744.28 760.88 771.75 783.08 792.92 805.13 838.07 850.88 872.08 883.45 924.91 947.35 958.01 985.60 1012.43 1034.82 1065.17 1122.92 1152.85 1159.90 1171.05 1186.15 1209.15 1244.16 1276.72 1297.35 1321.75 1323.76 1337.23 1364.39 1380.13 1396.74 1422.43 1439.48 1449.83 1470.44 1490.41 1505.40 1522.34 1547.30 1571.72 1597.75 1611.62 1620.36 1624.03 1665.07 1717.46 3208.68 3238.69 3249.87 3269.06 3275.31 3276.07 3682.31
irintensity: 0.00000 0 0 0 0 0 2.92776 8.27798 1.64259 11.20294 33.45274 79.81340 61.06402 0.12054 37.56773 57.42637 8.77900 139.29563 9.63561 24.16631 25.46278 57.11708 36.86082 10.01509 118.37474 40.44171 60.09804 260.40159 249.25645 35.31287 70.87494 116.48142 42.43325 51.03489 276.63998 94.40061 68.15704 5.08443 203.72351 36.33513 22.54028 20.49214 1.23522 22.93719 149.83120 46.22689 30.60954 138.92071 140.16374 67.91509 54.61973 212.60204 5.03696 123.45380 131.46056 160.68508 160.73844 106.80623 51.09757 130.56432 260.23393 21.14009 34.10989 27.42004 37.82493 17.07645 18.00861 11.03285 48.72319 122.71278 4.01069 79.94820 164.74056 30.47918 127.43637 118.63605 6.62439 3.44915 26.54743 125.36126 42.29935 13.07941 145.97972 76.03631 191.10863 85.86720 0.36406 9.82631 20.61098 224.76530 52.45271 119.94103 8.19555 172.70351 126.13070 202.23236 17.68275 307.03981 61.79172 107.89006 293.19210 324.30118 125.55851 29.84292 961.85556 214.38591 1062.38356 2.88872 7.25238 129.85530 28.82597 301.07871 1259.08830 1228.42025 444.46196 59.20452 643.29038 298.50139 923.94633 65.27358 81.15061 84.76568 8.20606 72.33422 3.73516 295.98471
energy: -2940.096467784 hartree
zeropoint: 0.23180344628 hartree
formula: C19H7Li8N3S5
InChI: InChI=1/C19H7N3S3.8Li.2S/c23-10-4-3-9-13-14(10)16(24)8-2-1-7-5-6-20-17-11(7)12(8)15(13)18(21-17)22-19(9)25;;;;;;;;;;/h1-6,22H;;;;;;;;;;/q-3;;;;;;;+1;+2;;/rC19H7Li8N3S5/c1-2-9-13-11-8(1)16-28-15-12(11)14-10-7(4-6-29-17(10)30(15)20-29)3-5-18(14)19(13)26(18)34(19)24-33(9)25-35(21-31-16)22-32(23-35)27(33)34/h1-6,28H
42 atoms
C  -0.79474335 -1.80202042 -1.55231593
N  -1.82294508 -0.9980832 -1.83074652
C  0.31173183 -1.4188289 -0.77798979
C  -1.80587225 0.26562654 -1.34605133
C  0.34266212 -0.10324321 -0.28481472
C  -0.73803061 0.75960693 -0.56719294
N  -2.87850013 1.00881103 -1.66368131
C  -0.78055896 2.0906097 -0.07530716
C  -2.90845622 2.28125318 -1.19973404
C  -1.93792272 2.85570984 -0.43502022
C  1.4360722 0.3438444 0.50159329
C  1.36537444 1.66291319 0.98443783
C  0.2880424 2.51561279 0.70501873
C  1.38277461 -2.33956189 -0.51493786
C  2.53240084 -1.88709951 0.19953099
C  2.5054174 -0.58927209 0.78861876
H  0.2978367 3.52441035 1.10084342
H  -2.04366376 3.88041626 -0.10314287
H  -3.7865435 2.85484255 -1.47712209
C  3.6593808 -2.7887405 0.26042699
C  1.25349942 -3.67815817 -1.01139868
N  -0.81500981 -3.05901842 -2.05190058
C  0.17831693 -4.01594066 -1.82677795
C  3.44291609 -4.1428174 -0.09040131
C  2.29711036 -4.60963048 -0.68027389
H  4.25449224 -4.84414171 0.08955542
H  2.16212557 -5.66520993 -0.87641567
S  0.04602992 -5.50165138 -2.72826771
H  -1.58322681 -3.32349671 -2.64907264
S  5.3817661 -2.22160243 0.14845554
S  3.53534708 -2.63901931 -3.83847379
H  2.19566578 2.05087038 1.56068508
S  3.6854717 -0.08728132 2.04093949
S  4.0093515 0.89583029 -2.38362198
Li 2.64822627 -0.97694715 -2.34742683
Li 4.69777939 -0.6340565 -3.93011061
Li 2.0746723 -4.28325258 -3.19468278
Li 1.46836519 -0.39666243 2.73065238
Li 4.68893882 -2.21594155 2.35001822
Li 4.71908973 -3.11751173 -1.92864359
Li 4.53534988 0.05743019 -0.3126646
Li -3.60576559 -0.5351316 -2.7120126
energy: -2940.0964677841566
energyOcCorr: -2940.1049964984
s2: 0.79229314
charge: -1.000000
dipole: 690.259822 -698.112235 -7.852414 -566.213137 567.773655 1.560518 -413.707720 421.484079 7.776360
quadrupole: 7220.517366 -7397.737840 -177.220475 6022.802915 -6247.051928 -224.249013 3039.231069 -3207.360067 -168.128998 -2852.224817 2839.968624 -12.256193 -539.950529 599.348024 59.397495 2072.469258 -2102.953944 -30.484687
temp: 298.15 k
press: 1.0 bar
thermalcorrgfe: 0.17092742784599999 hartree
thermalcorrener: 0.264277258028 hartree
entropy: 0.83036 kJ.mol-1.K-1
thermalcorrenthalpy: 0.265221839932 hartree
