title: ChemShell job
elementType: c
basis: def2-mSVP
elementType: n
elementType: h
elementType: s
elementType: li
method: uhf
method: dft
functional: pbeh-3c
elementType: c n h s li
basis: def2-mSVP def2-mSVP def2-mSVP def2-mSVP def2-mSVP
frequency: -0.00 -0.00 -0.00 -0.00 -0.00 0.0000 17.89 24.05 36.41 42.33 50.84 55.22 56.12 61.11 66.17 69.39 79.88 82.96 93.53 99.46 113.33 124.28 137.18 147.42 149.20 158.12 171.50 172.47 197.34 205.29 208.95 220.86 225.40 232.45 241.74 265.85 278.77 284.85 296.96 316.40 321.07 326.40 333.32 348.94 356.04 359.44 365.31 379.83 390.38 394.10 401.30 416.87 431.68 447.35 464.92 470.26 488.01 496.05 512.89 516.03 526.68 532.73 551.88 555.19 559.18 564.00 586.28 588.92 612.99 622.69 658.73 670.80 677.55 687.73 730.86 741.97 760.84 769.24 796.72 807.87 830.75 843.35 848.87 860.70 887.01 919.06 942.42 949.67 1010.54 1018.36 1018.61 1035.56 1105.51 1122.56 1151.64 1155.81 1189.43 1225.83 1241.01 1273.61 1295.85 1308.01 1335.66 1341.48 1345.43 1376.85 1407.12 1417.98 1435.19 1443.06 1466.20 1479.52 1494.48 1530.19 1555.87 1568.40 1587.12 1630.48 1642.25 1650.48 1666.27 1713.40 3191.86 3210.95 3246.56 3260.59 3269.33 3274.70 3678.93
irintensity: 0.00000 0.00000 0.00000 0.00000 0.00000 0 33.62373 5.01987 49.94489 77.43429 32.75059 89.20435 41.28198 190.25063 33.45726 51.10783 67.88771 86.66057 16.70596 2.85011 24.26347 115.57875 14.51051 32.57020 129.62067 45.53193 62.98731 19.66897 7.36506 14.81640 45.65809 72.44834 53.02268 25.20978 10.02904 24.73721 135.88963 156.52954 14.44477 30.66283 64.76497 68.11681 21.51581 67.37375 79.01205 54.24331 135.80010 89.56708 233.98589 46.68344 98.66146 290.48662 134.48731 94.03639 119.15008 205.04597 290.57578 47.64875 43.63744 111.08761 491.14840 50.19998 13.98183 145.91802 151.47278 48.48305 137.22152 75.12095 17.18019 87.10843 26.50231 66.41956 0.71610 16.50718 107.86755 51.24480 2.23429 15.93258 12.20479 10.32885 54.64760 159.20528 90.02927 4.36998 31.38890 100.45987 25.73912 102.45883 2.58331 0.48343 43.96122 8.81891 124.46480 420.73358 69.14640 78.18312 47.15772 154.35963 39.94775 122.12967 4.91846 46.98268 118.02459 316.86094 14.80935 0.64282 301.17854 1.62701 393.54598 507.88862 22.04177 614.93086 124.50775 170.63414 361.64207 646.78912 1711.53816 291.61460 159.28948 476.75494 666.58513 1501.22047 61.97903 159.61492 54.86647 9.00666 58.06730 24.45382 349.90382
energy: -2947.492384582 hartree
zeropoint: 0.23187962223999997 hartree
formula: C19H7Li9N3S5
InChI: InChI=1/C19H7N3S3.9Li.2S/c23-10-4-3-9-13-14(10)16(24)8-2-1-7-5-6-20-17-11(7)12(8)15(13)18(21-17)22-19(9)25;;;;;;;;;;;/h1-6,22H;;;;;;;;;;;/rC19H7Li9N3S5/c20-33-23-35(21)27-19-8-5-7-10-11-12-9-6(2-4-29-15(9)30-16(11)31-17(7)32)1-3-18(12)14(13(10)19)34(26(18)33)24-36(19,22,25(8)19)28(19,27,34)35/h1-5,8,31H
43 atoms
C  -1.36136534 -2.01991177 -0.95303139
N  -2.46725952 -1.29874255 -0.94888549
C  -0.08182359 -1.54068492 -0.63036893
C  -2.38554993 0.0060426 -0.60060883
C  0.0260278 -0.19420008 -0.26011507
C  -1.14135427 0.59940213 -0.24120677
N  -3.5275104 0.70969562 -0.61030203
C  -1.07936038 1.97452637 0.11640499
C  -3.45039171 2.00592967 -0.26895207
C  -2.31284234 2.6815279 0.08993339
C  1.29457286 0.35686866 0.07118429
C  1.32042225 1.721899 0.43843805
C  0.16517128 2.50764721 0.45856265
C  1.05602558 -2.40098823 -0.65463612
C  2.32415173 -1.87860699 -0.34520606
C  2.45374882 -0.49050544 -0.05767409
H  0.23889037 3.5484066 0.75140652
H  -2.35580693 3.73238268 0.34703546
H  -4.3942126 2.54498041 -0.28883057
C  3.5029958 -2.78397838 -0.30450577
C  0.84542871 -3.77920877 -1.05138148
N  -1.47099473 -3.34006892 -1.29764595
C  -0.42283285 -4.23951752 -1.37280735
C  3.23197193 -4.16011943 -0.74277222
C  2.01323867 -4.62314498 -1.11903757
H  4.07044474 -4.85439665 -0.76246471
H  1.89425529 -5.63867806 -1.47463863
S  -0.8279965 -5.83092144 -1.86682499
H  -2.38955693 -3.68449138 -1.53176233
S  4.27278061 -2.84217928 1.42440514
S  6.27148249 -1.71643561 -2.54905011
H  2.25727104 2.16663335 0.75417282
S  4.05694674 0.30120217 0.0055923
S  3.29564512 1.30542335 -3.74653148
Li 4.93997944 0.20944638 -2.56477991
Li 5.40509649 -1.67753931 -0.37224166
Li 4.08079754 3.39706021 -3.95859625
Li 7.49574675 -1.83033889 -4.440801
Li 3.80298237 -0.62818193 2.14091876
Li 5.62395636 -4.71757927 1.79080409
Li 4.22781032 -2.76128309 -2.36227363
Li 2.52315721 1.30016925 -1.64414241
Li 2.05215367 -3.77585977 1.19720076
energy: -2947.4923845823987
energyOcCorr: -2947.4956606578
s2: 0.77912215
charge: 0.000000
dipole: 711.684594 -692.593165 19.091429 -565.425186 564.901185 -0.524001 -387.639444 392.167234 4.527790
quadrupole: 9280.394252 -9294.873402 -14.479150 6636.673937 -6760.037923 -123.363986 2389.549597 -2508.771943 -119.222346 -2385.495917 2308.156045 -77.339872 -1708.210098 1675.338163 -32.871935 960.700410 -1018.368664 -57.668253
temp: 298.15 k
press: 1.0 bar
thermalcorrgfe: 0.163485036554 hartree
thermalcorrener: 0.2671871797 hartree
entropy: 0.92151 kJ.mol-1.K-1
thermalcorrenthalpy: 0.268131761604 hartree
