title: ChemShell job
elementType: c
basis: def2-TZVPD
elementType: n
elementType: h
elementType: s
elementType: li
method: uhf
method: dft
functional: cam-b3lyp
elementType: c n h s li
basis: def2-TZVPD def2-TZVPD def2-TZVPD def2-TZVPD def2-TZVPD
energy: -2538.375143340 hartree
formula: C19H7Li7N3S4
InChI: InChI=1/C19H7N3S2.7Li.2S/c23-16-9-2-1-3-11-13(9)15-14-10(16)5-4-8-6-7-20-17(12(8)14)21-18(15)22-19(11)24;;;;;;;;;/h1,3-7,22H;;;;;;;;;/rC19H7Li7N3S4/c20-31-15-8-2-1-7-4-6-27-16-10(7)11(8)13-12-9(18(30)29-17(13)28-16)3-5-19(14(12)15)25(31)26(19)24(33(25,26)22)32(26,21)23-31/h1-6,29H
40 atoms
C  -1.7056878 -2.28190874 -0.29727496
N  -2.78905068 -1.57799582 -0.03733
C  -0.41424095 -1.7620358 -0.49127795
C  -2.6546277 -0.23582797 0.07394999
C  -0.24421297 -0.37619496 -0.34573596
C  -1.38149184 0.40223595 -0.05118199
N  -3.76099457 0.47088895 0.31322097
C  -1.27438685 1.7969838 0.11626899
C  -3.64273759 1.79732679 0.44924695
C  -2.46487972 2.50466171 0.37383596
C  1.03606988 0.20359098 -0.48376295
C  1.11860487 1.60759482 -0.26167697
C  0.018795 2.37251973 0.018052
C  0.66674292 -2.60431371 -0.81706091
C  1.97141678 -2.04314477 -1.05081388
C  2.13571176 -0.63231593 -0.8360639
H  0.13350499 3.43878961 0.16928998
H  -2.45878572 3.57854959 0.50711094
H  -4.56862248 2.33175374 0.63850693
C  3.06056965 -2.87542267 -1.47716683
C  0.45122995 -4.00517055 -0.9000149
N  -1.84006879 -3.64016259 -0.38507795
C  -0.8591009 -4.53885948 -0.64646593
C  2.76302169 -4.24988052 -1.55429782
C  1.53567882 -4.83137345 -1.24854186
H  3.5428726 -4.93655444 -1.88086079
H  1.38999584 -5.90172433 -1.30742485
S  -1.24509086 -6.1786573 -0.66873992
H  -2.76768669 -4.01323555 -0.22571197
S  4.4641035 -2.51090872 1.7281638
S  6.76404523 -2.18978075 -1.51033083
H  2.08713376 2.08751677 -0.30919397
S  3.74408857 0.10019399 -1.01185388
Li 4.64055348 -1.72279781 -2.34130174
Li 5.75373735 -1.07308188 0.28258797
Li 3.20021463 -0.64231293 1.29741485
Li 3.63550459 1.7752258 -2.6752307
Li 8.31304406 -3.20637264 -2.78373268
Li 5.02722643 -3.34889362 -0.44785695
Li 2.6412537 -3.61857859 0.8578419
energy: -2538.3751433403627
energyOcCorr: -2538.3861313861
s2: 0.80455129
charge: -0.000000
dipole: 488.674696 -477.565737 11.108959 -686.220072 693.104989 6.884918 -190.082894 183.622745 -6.460149
quadrupole: 8772.169963 -8866.860781 -94.690818 6788.019663 -6967.098543 -179.078880 895.364295 -1018.019711 -122.655416 -2451.781239 2427.619591 -24.161648 -1154.269820 1072.853657 -81.416163 1017.144788 -1011.193024 5.951765
