title: ChemShell job
elementType: c
basis: def2-TZVPD
elementType: n
elementType: h
elementType: s
elementType: li
method: uhf
method: dft
functional: cam-b3lyp
elementType: c n h s li
basis: def2-TZVPD def2-TZVPD def2-TZVPD def2-TZVPD def2-TZVPD
energy: -1711.577900954 hartree
formula: C19H7Li3N3S2
InChI: InChI=1/C19H7N3S2.3Li/c23-16-9-2-1-3-11-13(9)15-14-10(16)5-4-8-6-7-20-17(12(8)14)21-18(15)22-19(11)24;;;/h1,3-7,22H;;;/q-2;;;+2/rC19H7Li3N3S2/c26-17-9-3-5-19-14-12(9)13-11-8(15(14)27-21(19)22(19)27)2-1-7-4-6-24-18(10(7)11)25(20-24)16(13)23-17/h1-6,23H
34 atoms
C  -1.36666084 -2.04486577 -0.57989993
N  -2.46814672 -1.31478285 -0.42005595
C  -0.06773399 -1.52316883 -0.60002493
C  -2.32084374 0.021015 -0.26675297
C  0.10026299 -0.13397699 -0.44106995
C  -1.05144788 0.65589593 -0.27077097
N  -3.45514161 0.70716392 -0.10667499
C  -0.97354189 2.05033977 -0.10275999
C  -3.36992962 2.04270077 0.05288999
C  -2.19536775 2.74851669 0.06293499
C  1.38580284 0.44522595 -0.45086595
C  1.44111684 1.85735179 -0.28028297
C  0.31962996 2.6283067 -0.11354999
C  1.04474088 -2.36979073 -0.77285191
C  2.36675873 -1.81639979 -0.78972091
C  2.52174072 -0.39378795 -0.62529593
H  0.42027495 3.69950158 0.012742
H  -2.20707175 3.82218357 0.19661398
H  -4.31374951 2.55985671 0.17941998
C  3.5095266 -2.6576687 -0.96564489
C  0.84204591 -3.76170257 -0.92708389
N  -1.50021483 -3.38740462 -0.73349192
C  -0.48953894 -4.28626652 -0.9045669
C  3.23717463 -4.02865154 -1.11317888
C  1.97155578 -4.58917248 -1.09852287
H  4.07205154 -4.71261147 -1.24969586
H  1.82638279 -5.65478436 -1.21685086
S  -0.8960769 -5.91645033 -1.07122688
H  -2.43933972 -3.76508158 -0.71836492
H  2.41295673 2.33384773 -0.28317897
S  4.13441853 0.31949296 -0.63954793
Li 4.73027146 -1.41961284 -2.20445575
Li 4.90656845 -1.7384308 0.35925096
Li -4.48113749 -1.05519288 -0.20927398
energy: -1711.5779009536343
energyOcCorr: -1711.5824638675
s2: 0.82313415
charge: -0.000000
dipole: 106.806047 -106.653098 0.152949 -421.049811 423.967966 2.918155 -201.367068 201.767572 0.400504
quadrupole: 3945.785682 -3975.472133 -29.686450 5360.300164 -5545.028482 -184.728319 345.984676 -460.690839 -114.706163 -751.193817 732.181901 -19.011916 -428.753542 420.127776 -8.625766 1025.210694 -1034.969189 -9.758496
