title: ChemShell job
elementType: c
basis: def2-mSVP
elementType: n
elementType: h
elementType: s
elementType: li
method: uhf
method: dft
functional: pbeh-3c
elementType: c n h s li
basis: def2-mSVP def2-mSVP def2-mSVP def2-mSVP def2-mSVP
frequency: -0.00 0.0000 0.0000 0.0000 0.0000 0.0000 55.35 70.13 92.71 119.97 142.73 181.27 199.81 211.66 224.72 291.39 299.18 318.58 329.40 360.04 370.47 401.75 447.47 480.86 504.28 523.02 528.42 537.01 539.48 568.60 577.16 584.67 593.56 642.35 658.97 685.14 706.39 724.50 731.44 773.85 775.09 784.45 792.19 838.82 847.61 870.09 887.05 906.41 913.18 936.96 969.75 1017.58 1033.80 1046.67 1049.36 1072.81 1131.32 1143.83 1162.26 1175.20 1206.16 1265.03 1292.72 1306.44 1326.47 1335.11 1351.85 1381.81 1386.20 1397.52 1416.78 1462.13 1470.89 1495.70 1506.54 1521.54 1544.12 1564.70 1590.25 1608.42 1629.01 1651.02 1659.29 1706.61 1721.87 1738.49 3221.76 3246.57 3271.73 3274.14 3288.72 3289.11 3631.80
irintensity: 0.00000 0 0 0 0 0 3.24332 4.62856 44.52478 108.00690 36.04609 7.87414 0.32073 5.04977 25.41675 10.41092 49.45426 1.56705 28.94799 2.43530 8.12054 26.39911 11.54409 18.52110 11.44388 83.83074 1.27770 12.43679 26.65137 17.27509 3.79192 43.86306 8.30083 10.69575 25.27320 37.78543 14.58068 5.00176 73.92673 7.27406 10.72214 33.35804 12.38229 10.05756 15.88409 8.29317 8.78856 46.40269 59.53520 39.44887 47.22460 29.52942 0.11214 0.17243 0.02740 2.84532 16.73341 51.84599 83.88641 193.81731 173.01840 373.82657 39.57918 17.24270 91.34717 28.22327 34.95412 64.93764 817.87762 72.98808 13.09429 166.26139 6.40103 96.94629 100.69214 207.77008 666.81638 54.74128 4.80773 10.41779 623.83199 275.68121 82.26350 549.00977 101.64938 903.81902 79.37500 66.12272 6.12867 0.04464 8.05476 15.86230 170.68680
energy: -1295.816033882 hartree
zeropoint: 0.21588267063999997 hartree
formula: C19H7LiN3S
InChI: InChI=1/C19H7N3S.Li/c23-19-12-3-1-2-10-8-11-5-4-9-6-7-20-17-15(9)14(11)16(13(10)12)18(21-17)22-19;/h1,3-7,22H;/rC19H7LiN3S/c20-12-4-3-10-15-11(12)7-9-2-1-8-5-6-21-17-14(8)13(9)16(15)18(22-17)23-19(10)24/h1-6,23H
31 atoms
C  -1.67584918 -2.68146776 -0.38437114
N  -2.75521237 -1.97443486 -0.20101043
C  -0.36716099 -2.1554195 -0.53468938
C  -2.62577187 -0.62312548 -0.13925067
C  -0.21882484 -0.77520773 -0.44927959
C  -1.36155635 0.00995599 -0.23844401
N  -3.74371408 0.09256289 0.01495659
C  -1.25367703 1.41237024 -0.14326696
C  -3.63256951 1.41016632 0.09208792
C  -2.43637831 2.12011454 0.03047912
C  1.06720946 -0.17128197 -0.58657153
C  1.15790173 1.25742929 -0.46151948
C  0.05390591 2.00894244 -0.24309734
C  0.72425043 -3.00293031 -0.77486844
H  0.13924085 3.0840329 -0.15212578
H  -2.44252464 3.19884672 0.11014411
H  -4.56158637 1.95656017 0.21470029
C  0.53408483 -4.39908199 -0.84217457
N  -1.79514022 -4.04861727 -0.44446589
C  -0.79871625 -4.94660184 -0.65705499
C  2.90777211 -4.61108366 -1.29164592
C  1.6501427 -5.1867778 -1.09550175
H  3.72151733 -5.29996544 -1.49609459
H  1.53025216 -6.2621076 -1.14646427
H  -2.72817575 -4.42389082 -0.32391294
H  2.13011035 1.72498095 -0.54698949
S  -1.16774456 -6.56905301 -0.6935317
C  2.08087975 -1.05058675 -0.83582838
C  3.1768168 -3.23826801 -1.23931091
C  2.02688355 -2.44253122 -0.95855705
Li 5.06682051 -2.44617552 -1.57127249
energy: -1295.8160338817963
energyOcCorr: -1295.8168233742
s2: 0.78178676
charge: 0.000000
dipole: -109.031622 116.068347 7.036725 -609.192489 612.628948 3.436460 -166.450726 165.451297 -0.999430
quadrupole: 2585.794578 -2642.842568 -57.047990 6559.893146 -6693.962884 -134.069738 269.737393 -372.847023 -103.109630 -425.585438 393.558206 -32.027232 -326.340294 307.882209 -18.458085 1051.548201 -1050.270511 1.277689
temp: 298.15 k
press: 1.0 bar
thermalcorrgfe: 0.173102251504 hartree
thermalcorrener: 0.231521595228 hartree
entropy: 0.52275 kJ.mol-1.K-1
thermalcorrenthalpy: 0.232466177132 hartree
