title: ChemShell job
elementType: c
basis: def2-mSVP
elementType: n
elementType: h
elementType: s
elementType: li
method: uhf
method: dft
functional: pbeh-3c
elementType: c n h s li
basis: def2-mSVP def2-mSVP def2-mSVP def2-mSVP def2-mSVP
frequency: -0.00 -0.00 -0.00 -0.00 -0.00 0.0000 18.94 33.05 52.25 67.48 75.57 82.50 112.44 145.95 178.47 180.83 191.36 193.78 221.00 223.89 260.21 294.79 298.59 309.18 327.12 328.97 339.61 344.20 359.52 379.52 395.16 416.76 423.34 426.98 442.43 499.10 523.79 533.73 546.58 554.16 558.86 585.86 588.46 590.93 623.25 643.22 677.73 694.51 701.54 745.84 746.96 767.41 773.90 779.85 791.57 812.13 836.02 854.63 864.96 867.98 879.04 930.34 971.65 995.83 998.09 1001.26 1042.59 1050.50 1123.07 1140.51 1160.75 1175.40 1202.72 1227.51 1261.64 1273.10 1286.83 1314.16 1333.19 1352.46 1370.51 1393.41 1408.07 1434.30 1461.38 1470.15 1481.35 1489.22 1521.96 1550.35 1557.02 1588.59 1600.08 1618.22 1623.17 1668.83 1683.29 1723.87 3163.61 3244.44 3245.87 3262.21 3269.74 3278.02 3636.72
irintensity: 0.00000 0.00000 0.00000 0.00000 0.00000 0 78.18285 67.44998 12.33410 23.35375 104.42831 58.57284 58.62067 10.60112 7.27214 171.94762 22.67437 10.80474 163.11622 3.88350 87.14591 17.34039 4.93143 68.31261 18.58246 7.05780 15.72888 11.63577 21.57596 11.01400 43.54695 180.54540 14.73274 133.07398 132.88641 9.10796 103.53419 16.68343 7.04073 194.64442 14.97936 55.12630 90.95017 31.54583 12.85707 23.60059 352.18367 64.11757 0.61526 369.56888 26.32618 92.50556 30.50355 74.56679 42.84443 12.90953 193.78516 1.49894 188.37212 105.58974 3.06963 183.97534 223.73565 1.17457 0.43146 8.42165 355.69838 45.21172 720.20965 75.40767 485.10202 46.44540 96.33656 230.20821 165.90970 1102.33636 14.61692 681.90622 1392.78605 1854.40855 1797.14262 824.06716 1016.82299 3.19206 125.03402 236.84115 998.30878 18.06884 359.13851 193.10190 1099.67226 84.03980 626.87113 117.17041 485.72003 21.38332 406.40635 472.12290 265.50948 48.31897 62.33024 45.36521 108.72900 6.48103 140.76264
energy: -1716.342757153 hartree
zeropoint: 0.22079602006000001 hartree
formula: C19H7Li4N3S2
InChI: InChI=1/C19H7N3S2.4Li/c23-16-9-2-1-3-11-13(9)15-14-10(16)5-4-8-6-7-20-17(12(8)14)21-18(15)22-19(11)24;;;;/h1,3-7,22H;;;;/q-2;;;;+2/rC19H7Li4N3S2/c20-28-15-8-2-1-7-4-6-25-18-10(7)11(8)13-12-9(17(27)24-16(13)26(18)23-25)3-5-19(21-28,22-28)14(12)15/h1-6,24H
35 atoms
C  -1.31739111 -2.03508123 -0.53670819
N  -2.4190724 -1.28957991 -0.35013892
C  -0.02142414 -1.52827937 -0.60777348
C  -2.26253421 0.04271363 -0.22226177
C  0.15513749 -0.12733077 -0.48079095
C  -0.98231139 0.67129556 -0.28335712
N  -3.38916966 0.73886797 -0.0449505
C  -0.89723662 2.07316592 -0.15688992
C  -3.29234958 2.08997764 0.08623009
C  -2.12444745 2.7848822 0.04276306
C  1.45482159 0.43532219 -0.56002975
C  1.50711023 1.85588852 -0.45965168
C  0.38545373 2.63629464 -0.25949359
C  1.07854917 -2.39401332 -0.81415026
C  2.41147613 -1.84679816 -0.88394827
C  2.55772296 -0.42819072 -0.73316428
H  0.50039654 3.71216495 -0.19318684
H  -2.12467904 3.86242075 0.15223025
H  -4.23276917 2.60951067 0.23166444
C  3.53281876 -2.71105681 -1.10174716
C  0.85437786 -3.78806409 -0.94829582
N  -1.46931726 -3.37459857 -0.67049236
C  -0.47979454 -4.28577098 -0.87259391
C  3.22771799 -4.08267488 -1.22359525
C  1.96753234 -4.64083507 -1.15552649
H  4.05362017 -4.77466057 -1.38840844
H  1.80377543 -5.70487098 -1.25895285
S  -0.93002304 -5.92207174 -1.01630875
H  -2.41147243 -3.74097156 -0.62000302
H  2.46307291 2.35174318 -0.57630603
S  4.21688074 0.25872831 -0.79697953
Li 4.68164217 -1.5131619 -2.38909063
Li 4.91955838 -1.84731917 0.20512332
Li 4.39028521 1.5123584 1.1588452
Li -4.42678913 -0.97002181 -0.22240575
energy: -1716.3427571532654
energyOcCorr: -1716.3445623109
s2: -0.00000000
charge: 0.000000
dipole: 145.365762 -139.742124 5.623637 -415.553011 422.258295 6.705284 -209.557746 212.628761 3.071015
quadrupole: 4152.398868 -4146.455437 5.943431 5441.763245 -5634.769019 -193.005774 401.662608 -514.878642 -113.216035 -714.807705 724.525486 9.717781 -503.989233 515.123954 11.134721 1037.464073 -1043.440796 -5.976723
temp: 298.15 k
press: 1.0 bar
thermalcorrgfe: 0.16956768696 hartree
thermalcorrener: 0.242612815004 hartree
entropy: 0.65154 kJ.mol-1.K-1
thermalcorrenthalpy: 0.24355739690800002 hartree
