title: ChemShell job
elementType: c
basis: def2-TZVPD
elementType: n
elementType: h
elementType: s
elementType: li
method: uhf
method: dft
functional: cam-b3lyp
elementType: c n h s li
basis: def2-TZVPD def2-TZVPD def2-TZVPD def2-TZVPD def2-TZVPD
energy: -1719.114299972 hartree
formula: C19H7Li4N3S2
InChI: InChI=1/C19H7N3S2.4Li/c23-16-9-2-1-3-11-13(9)15-14-10(16)5-4-8-6-7-20-17(12(8)14)21-18(15)22-19(11)24;;;;/h1,3-7,22H;;;;/q-2;;;;+2/rC19H7Li4N3S2/c20-28-15-8-2-1-7-4-6-25-18-10(7)11(8)13-12-9(17(27)24-16(13)26(18)23-25)3-5-19(21-28,22-28)14(12)15/h1-6,24H
35 atoms
C  -1.31739085 -2.03508077 -0.53670794
N  -2.41907273 -1.28957985 -0.35013896
C  -0.021424 -1.52827983 -0.60777393
C  -2.26253375 0.04271399 -0.22226198
C  0.15513798 -0.12733099 -0.48079094
C  -0.98231189 0.67129592 -0.28335697
N  -3.38916962 0.73886792 -0.04495099
C  -0.8972369 2.07316577 -0.15688998
C  -3.29234963 2.08997776 0.08622999
C  -2.12444776 2.78488268 0.04276299
C  1.45482183 0.43532195 -0.56002993
C  1.50710983 1.85588879 -0.45965195
C  0.38545396 2.6362947 -0.25949397
C  1.07854888 -2.39401373 -0.81414991
C  2.41147573 -1.84679779 -0.8839479
C  2.55772271 -0.42819095 -0.73316392
H  0.50039694 3.71216458 -0.19318698
H  -2.12467876 3.86242056 0.15222998
H  -4.23276952 2.60951071 0.23166397
C  3.5328186 -2.71105669 -1.10174687
C  0.8543779 -3.78806457 -0.94829589
N  -1.46931683 -3.37459862 -0.67049192
C  -0.47979494 -4.28577051 -0.8725939
C  3.22771764 -4.08267454 -1.22359486
C  1.96753278 -4.64083547 -1.15552687
H  4.05362054 -4.77466046 -1.38840884
H  1.80377579 -5.70487135 -1.25895286
S  -0.93002289 -5.92207133 -1.01630889
H  -2.41147273 -3.74097158 -0.62000293
H  2.46307272 2.35174273 -0.57630593
S  4.21688052 0.25872797 -0.79697991
Li 4.68164247 -1.51316183 -2.38909073
Li 4.91955844 -1.84731879 0.20512298
Li 4.3902855 1.51235883 1.15884487
Li -4.4267895 -0.97002189 -0.22240598
energy: -1719.1142999715039
energyOcCorr: -1719.1211744045
s2: 0.00000000
charge: -0.000000
dipole: 145.365751 -139.561587 5.804165 -415.552998 423.266511 7.713512 -209.557771 212.747085 3.189314
quadrupole: 4152.398765 -4153.438308 -1.039543 5441.763045 -5654.512772 -212.749727 401.662613 -516.808638 -115.146024 -714.807900 722.632159 7.824259 -503.989235 515.528653 11.539418 1037.463989 -1045.948367 -8.484378
