title: ChemShell job
elementType: c
basis: def2-mSVP
elementType: n
elementType: h
elementType: s
elementType: li
method: uhf
method: dft
functional: pbeh-3c
elementType: c n h s li
basis: def2-mSVP def2-mSVP def2-mSVP def2-mSVP def2-mSVP
frequency: -28.20 -0.00 -0.00 0.0000 0.0000 0.0000 0.0000 20.00 25.66 40.78 45.22 56.02 57.44 66.83 72.41 77.54 87.09 91.62 95.52 103.40 108.95 124.08 126.73 147.50 156.51 160.92 167.02 170.87 179.21 180.32 192.33 198.84 203.33 208.66 218.13 226.27 229.60 240.43 254.15 278.32 290.64 310.02 316.66 320.94 323.35 326.19 330.40 342.54 354.05 368.37 388.09 399.87 408.40 411.19 416.53 426.74 436.12 443.03 448.04 448.88 463.10 468.80 480.70 494.74 498.14 509.02 521.92 534.94 538.77 554.40 567.26 576.54 585.35 590.91 630.10 650.56 660.97 690.52 697.87 726.37 729.72 757.24 772.48 778.91 787.32 814.15 822.27 842.33 876.64 885.46 890.23 935.37 946.43 987.90 998.52 1016.91 1022.53 1073.17 1135.27 1157.41 1161.99 1179.04 1202.73 1238.70 1248.09 1279.58 1286.33 1314.94 1338.44 1348.22 1368.27 1387.12 1404.67 1441.44 1451.24 1474.22 1485.72 1491.29 1523.06 1550.21 1573.87 1589.77 1606.97 1619.87 1628.20 1681.75 1692.99 1724.39 3216.11 3229.07 3257.62 3259.28 3281.09 3290.76 3629.32
irintensity: 0.00000 0.00000 0.00000 0 0 0 0 17.91443 21.20936 25.91893 120.20102 83.92178 32.07389 16.48767 17.89641 89.31137 8.91484 49.18966 16.42886 29.73003 113.58059 5.41481 36.68404 54.30547 86.78678 92.28792 43.44197 120.41443 176.12990 14.82524 100.96069 86.07145 93.12225 229.72111 68.49899 14.63275 23.15727 56.61898 185.85828 30.57569 32.37754 187.17626 171.32401 93.95388 106.07773 66.52181 42.84509 57.84629 94.57840 70.46313 133.58196 18.63257 53.35256 132.37610 31.26805 32.96101 154.76891 42.34186 51.95221 18.71038 214.23422 87.20487 196.78892 145.96483 259.19049 494.39520 68.70944 6.88584 41.54956 90.61074 18.65944 10.12201 39.15619 34.70334 134.70918 31.10831 60.64831 125.27197 66.89941 25.55456 39.17126 294.58271 58.64669 43.06264 42.86721 165.81206 3.43128 3.43185 55.61577 75.09355 74.27818 38.65238 351.17897 23.66756 2.22832 0.38289 45.78904 75.33701 371.07402 49.78194 119.20959 35.13091 640.66384 501.62650 619.19857 4.35133 165.91948 462.78693 75.69130 732.21330 294.92476 3719.14573 211.29163 23.09620 270.58962 104.21623 1080.05772 30.22164 155.84244 412.84236 631.02930 257.57240 405.46393 254.57709 597.26806 40.13186 86.18989 666.06697 51.01995 50.19883 50.57279 32.24601 1.44329 36.85869 227.84812
energy: -2962.564800573 hartree
zeropoint: 0.23770708318 hartree
formula: C19H7Li11N3S5
InChI: InChI=1/C19H7N3S2.11Li.3S/c23-12-4-3-10-15-11(12)7-9-2-1-8-5-6-20-17-14(8)13(9)16(15)18(21-17)22-19(10)24;;;;;;;;;;;;;;/h1-6,22H;;;;;;;;;;;;;;/q-3;;;;;;;;;;+1;+2;;;/rC19H7Li11N3S5/c20-36-26-38(27-36)23-34-15-8-3-5-17-18-13(8)12-11-9(2-1-7-4-6-32-16(10(7)11)33(22-32)14(12)31-15)19(18)28-30(17,18,19)37(28,21)24-35(17,25-38)29(19)36/h1-6,31H
45 atoms
C  -0.8930013 -1.87767039 -1.46254783
N  -1.95273018 -1.09562178 -1.66839991
C  0.28968667 -1.46143464 -0.82301071
C  -1.87234149 0.19474488 -1.27119076
C  0.38581696 -0.11165809 -0.40849946
C  -0.71155882 0.73325732 -0.64831223
N  -2.95101436 0.93614809 -1.50626003
C  -0.68852872 2.09130866 -0.29034357
C  -2.92376487 2.24039065 -1.14635207
C  -1.85696629 2.85644018 -0.56001043
C  1.57077072 0.34950606 0.20080408
C  1.56786312 1.7350603 0.54137294
C  0.49677134 2.57478051 0.30893007
C  1.35898654 -2.35473323 -0.62935213
C  2.59684171 -1.8231898 -0.08927669
C  2.71569889 -0.49049014 0.38322156
H  0.56034344 3.61772169 0.59795043
H  -1.90448778 3.90517646 -0.30145407
H  -3.82763567 2.79998758 -1.35617355
C  3.70643378 -2.75443809 -0.07295489
C  1.22344866 -3.70299478 -1.05444528
N  -0.9210924 -3.14533134 -1.92385858
C  0.08375399 -4.05953384 -1.8026035
C  3.4884627 -4.11817203 -0.34040746
C  2.29744794 -4.61524858 -0.81035111
H  4.31598231 -4.80693866 -0.19737038
H  2.15899425 -5.67611785 -0.97067479
S  -0.0430445 -5.52237688 -2.6977155
H  -1.7316657 -3.42745151 -2.46205602
S  5.39609929 -2.14149816 -0.03478489
S  3.38437702 -2.6342855 -3.99075305
H  2.45071172 2.16658626 1.00575869
S  4.63174857 -0.8868857 3.61114909
S  3.79652047 0.98596369 -2.77650918
Li 2.49362532 -0.97020009 -2.6292202
Li 4.3726398 -0.56478534 -4.4186127
Li 2.18557265 2.22802255 -1.7819988
Li 2.09912396 -4.45660699 -3.42943581
Li 5.16631001 -0.66637012 5.80470344
Li 6.26772939 -1.63773102 2.16598415
Li 4.79910266 -2.99118006 -2.20224655
Li 4.51045879 0.0290079 -0.77092391
Li -3.86003096 -0.69763912 -2.31091424
Li 3.92587436 0.48052604 1.90601918
Li 3.34639312 -2.00434967 2.01892557
energy: -2962.5648005729740
energyOcCorr: -2962.5647175119
s2: 0.00000000
charge: 1.000000
dipole: 791.483614 -786.392537 5.091076 -584.035890 586.660758 2.624868 -397.573217 403.485807 5.912590
quadrupole: 8398.114642 -8429.540180 -31.425538 6189.313787 -6363.429839 -174.116052 4095.118709 -4195.306403 -100.187694 -2914.932713 2907.135181 -7.797532 121.991524 -29.424875 92.566649 1871.874985 -1889.505081 -17.630095
temp: 298.15 k
press: 1.0 bar
thermalcorrgfe: 0.169537216576 hartree
thermalcorrener: 0.274625762194 hartree
entropy: 0.93372 kJ.mol-1.K-1
thermalcorrenthalpy: 0.27557034409799996 hartree
