title: ChemShell job
elementType: c
basis: def2-TZVPD
elementType: n
elementType: h
elementType: s
elementType: li
method: uhf
method: dft
functional: cam-b3lyp
elementType: c n h s li
basis: def2-TZVPD def2-TZVPD def2-TZVPD def2-TZVPD def2-TZVPD
energy: -2966.819418307 hartree
formula: C19H7Li11N3S5
InChI: InChI=1/C19H7N3S2.11Li.3S/c23-12-4-3-10-15-11(12)7-9-2-1-8-5-6-20-17-14(8)13(9)16(15)18(21-17)22-19(10)24;;;;;;;;;;;;;;/h1-6,22H;;;;;;;;;;;;;;/q-3;;;;;;;;;;+1;+2;;;/rC19H7Li11N3S5/c20-36-26-38(27-36)23-34-15-8-3-5-17-18-13(8)12-11-9(2-1-7-4-6-32-16(10(7)11)33(22-32)14(12)31-15)19(18)28-30(17,18,19)37(28,21)24-35(17,25-38)29(19)36/h1-6,31H
45 atoms
C  -0.8930009 -1.87767078 -1.46254783
N  -1.95272978 -1.09562188 -1.66839981
C  0.28968697 -1.46143484 -0.82301091
C  -1.87234179 0.19474498 -1.27119086
C  0.38581696 -0.11165799 -0.40849995
C  -0.71155892 0.73325691 -0.64831193
N  -2.95101467 0.9361479 -1.50625983
C  -0.68852892 2.09130876 -0.29034397
C  -2.92376467 2.24039075 -1.14635187
C  -1.85696679 2.85644068 -0.56001094
C  1.57077082 0.34950596 0.20080398
C  1.56786282 1.7350608 0.54137294
C  0.49677094 2.57478071 0.30892997
C  1.35898685 -2.35473374 -0.62935193
C  2.59684171 -1.8231898 -0.08927699
C  2.71569869 -0.49048994 0.38322196
H  0.56034294 3.61772159 0.59795093
H  -1.90448778 3.90517656 -0.30145396
H  -3.82763557 2.79998768 -1.35617385
C  3.70643358 -2.75443769 -0.07295499
C  1.22344886 -3.70299458 -1.05444488
N  -0.92109289 -3.14533165 -1.92385878
C  0.08375399 -4.05953354 -1.80260379
C  3.48846261 -4.11817253 -0.34040796
C  2.29744774 -4.61524847 -0.81035091
H  4.31598251 -4.80693846 -0.19736998
H  2.15899376 -5.67611836 -0.97067489
S  -0.04304399 -5.52237737 -2.6977157
H  -1.7316658 -3.42745161 -2.46205572
S  5.39609939 -2.14149776 -0.034785
S  3.38437662 -2.6342857 -3.99075355
H  2.45071172 2.16658575 1.00575889
S  4.63174847 -0.8868859 3.61114959
S  3.79652057 0.98596389 -2.77650869
Li 2.49362572 -0.97019989 -2.6292197
Li 4.37263951 -0.56478493 -4.4186125
Li 2.18557275 2.22802275 -1.7819988
Li 2.09912376 -4.4566075 -3.42943561
Li 5.16631041 -0.66636993 5.80470334
Li 6.26772929 -1.63773082 2.16598376
Li 4.79910246 -2.99117966 -2.20224675
Li 4.51045849 0.029008 -0.77092391
Li -3.86003056 -0.69763892 -2.31091474
Li 3.92587456 0.48052594 1.90601879
Li 3.34639362 -2.00434977 2.01892577
energy: -2966.8194183068608
energyOcCorr: -2966.8238252358
s2: -0.00000000
charge: 1.000000
dipole: 791.483607 -786.461828 5.021779 -584.035893 587.086149 3.050255 -397.573226 404.019847 6.446621
quadrupole: 8398.114502 -8436.690290 -38.575788 6189.314328 -6375.461433 -186.147106 4095.119003 -4202.815208 -107.696204 -2914.932719 2907.146923 -7.785796 121.991641 -29.388554 92.603086 1871.875210 -1892.695450 -20.820240
