title: ChemShell job
elementType: c
basis: def2-TZVPD
elementType: n
elementType: h
elementType: s
elementType: li
method: uhf
method: dft
functional: cam-b3lyp
elementType: c n h s li
basis: def2-TZVPD def2-TZVPD def2-TZVPD def2-TZVPD def2-TZVPD
energy: -2966.893731368 hartree
formula: C19H7Li11N3S5
InChI: InChI=1/C19H7N3S2.11Li.3S/c23-16-9-2-1-3-11-13(9)15-14-10(16)5-4-8-6-7-20-17(12(8)14)21-18(15)22-19(11)24;;;;;;;;;;;;;;/h1,3-7,22H;;;;;;;;;;;;;;/q-2;;;;;;;;;;;+2;;;/rC19H7Li11N3S5/c20-35-23-36-19-16(26(19)36)4-1-7-3-6-32-15-9(7)12(16)10-11-8(14(34)31-13(10)33(15)22-32)2-5-18-17(11,19)29(18,19)30(18)28(18,36)37(30,21)25-38(29,30,24-35)27(36)37/h1-6,31H
45 atoms
C  -1.7555318 -2.07801576 -0.78129891
N  -2.79039368 -1.22844786 -0.75510891
C  -0.42346995 -1.68850581 -0.62330693
C  -2.54554771 0.08143199 -0.54060394
C  -0.15775398 -0.32369996 -0.41203696
C  -1.23788186 0.58335393 -0.35211396
N  -3.63949859 0.8661959 -0.52395394
C  -1.04651588 1.97155278 -0.10167499
C  -3.44610261 2.18805375 -0.30063696
C  -2.23607375 2.77660668 -0.08870899
C  1.18181187 0.13943899 -0.22564797
C  1.33125685 1.50008583 0.08327299
C  0.24943897 2.40364473 0.12127199
C  0.63020793 -2.6751647 -0.64397993
C  1.98135277 -2.27530174 -0.47327895
C  2.27300574 -0.83217191 -0.34457696
H  0.44671295 3.44830761 0.33315296
H  -2.17269275 3.84285457 0.08793999
H  -4.34712151 2.79264468 -0.29513797
C  3.05157765 -3.21595463 -0.57932393
C  0.27098297 -4.04376754 -0.8487909
N  -2.02840877 -3.39361461 -0.96438489
C  -1.07523888 -4.4176805 -1.00821489
C  2.6320527 -4.56302748 -0.77424091
C  1.33153185 -4.99056944 -0.8938559
H  3.40142462 -5.33523839 -0.84054791
H  1.08878488 -6.03589432 -1.04150488
S  -1.68061981 -6.01351632 -1.26093786
H  -2.99229866 -3.66699059 -1.07473788
S  6.84495023 -2.76427769 -0.33570496
S  5.03102143 -1.08959287 -2.99841666
H  2.32431474 1.90264679 0.24434497
S  3.81017957 -0.35416196 0.52311494
S  3.96633755 2.6592177 -2.81221668
Li 5.19163041 1.06420888 -3.88846756
Li 5.81033734 -0.67958792 -0.76570991
Li 4.94068744 3.85281756 -1.20483886
Li 7.17781819 -2.07086077 -2.6023207
Li 1.91004778 -0.35392396 1.84941179
Li 8.46725104 -3.82908957 0.84830391
Li 4.91774244 -3.17656364 -1.64861581
Li 3.59162659 0.69277192 -1.67433481
Li 4.63892147 -2.6377257 0.73653092
Li 2.89552867 -1.7704678 -2.31964774
Li -4.74741546 -0.74414892 -0.94540089
energy: -2966.8937313683819
energyOcCorr: -2966.9084959783
s2: 0.79832413
charge: 0.000000
dipole: 692.637937 -678.294292 14.343645 -559.464770 564.175048 4.710278 -408.197929 413.079551 4.881622
quadrupole: 11365.635731 -11275.810705 89.825026 7285.483414 -7535.552181 -250.068767 1695.663634 -1864.045223 -168.381588 -1705.110363 1631.384170 -73.726193 -1827.234649 1837.020611 9.785963 872.851738 -883.805584 -10.953846
