title: ChemShell job
elementType: c
basis: def2-mSVP
elementType: n
elementType: h
elementType: s
elementType: li
method: uhf
method: dft
functional: pbeh-3c
elementType: c n h s li
basis: def2-mSVP def2-mSVP def2-mSVP def2-mSVP def2-mSVP
frequency: -17.15 -0.00 0.0000 0.0000 0.0000 0.0000 0.0000 29.04 35.47 50.53 54.52 60.27 69.80 76.46 89.97 96.86 102.26 108.09 113.27 117.80 125.50 133.40 140.31 145.49 161.82 162.41 174.47 183.48 188.72 193.71 198.21 210.09 213.32 223.74 225.23 231.95 250.65 260.29 264.71 279.96 292.55 305.30 313.12 319.05 327.47 329.85 335.80 346.27 358.99 368.68 388.36 394.84 404.70 410.52 411.54 417.81 439.48 441.35 447.82 456.25 460.12 469.62 470.05 483.76 498.53 506.78 510.93 516.52 522.91 528.91 545.67 557.77 574.12 578.08 586.09 625.37 645.20 658.43 672.47 682.31 720.79 747.16 758.67 763.72 773.14 789.94 805.06 810.44 827.98 866.72 882.71 887.70 915.85 939.26 985.57 1010.64 1013.71 1061.58 1111.54 1141.09 1154.58 1172.20 1174.27 1204.98 1229.37 1264.61 1289.35 1304.94 1326.00 1327.95 1346.44 1356.10 1392.17 1418.31 1434.52 1449.87 1457.33 1486.91 1508.43 1517.40 1532.14 1567.97 1578.59 1598.00 1605.52 1623.71 1647.31 1712.37 3178.89 3215.28 3239.46 3251.46 3273.09 3276.78 3680.76
irintensity: 0.00000 0.00000 0 0 0 0 0 4.98621 17.65583 44.71704 81.79880 40.36635 23.43245 17.16200 5.47856 35.47580 53.43873 49.61502 34.46524 70.41221 65.93811 3.57665 86.81897 42.07559 23.27994 0.18124 25.81732 106.48683 88.05424 28.69528 17.65055 83.02916 150.86949 185.02007 126.12778 162.10877 95.87967 216.94519 170.86701 19.89460 20.77154 143.93500 56.31287 205.55012 23.36153 145.73266 22.14063 5.01926 85.08408 15.81244 75.70068 70.17131 53.41292 35.71049 157.84214 174.24169 40.57065 39.77232 65.56748 88.26072 123.81874 66.71049 112.28174 68.87489 220.21885 231.03179 326.37603 28.37222 55.88385 448.00287 100.90241 5.98143 18.04981 35.94537 21.85583 5.09051 109.96471 30.78541 7.00475 115.90626 46.47447 155.08216 73.67855 82.69853 4.47710 29.64198 10.12620 8.21654 135.13162 11.62399 29.94009 28.64234 97.71881 264.37899 68.85174 100.70944 0.48251 25.79099 553.53292 168.06501 94.55901 91.81165 73.25693 118.80177 115.71364 42.15917 144.35526 118.83953 117.92947 33.62154 490.54087 95.87681 2.45423 269.28173 654.50433 679.20920 337.80370 243.14437 41.43950 112.71488 6.96136 2660.11584 542.65057 839.17373 196.75066 280.32278 409.64671 806.40575 89.56715 58.44391 77.80726 57.09217 77.31186 4.40543 343.32670
energy: -2962.650452551 hartree
zeropoint: 0.23530754043999996 hartree
formula: C19H7Li11N3S5
InChI: InChI=1/C19H7N3S2.11Li.3S/c23-12-4-3-10-15-11(12)7-9-2-1-8-5-6-20-17-14(8)13(9)16(15)18(21-17)22-19(10)24;;;;;;;;;;;;;;/h1-6,22H;;;;;;;;;;;;;;/q-3;;;;;;;;;;+1;+2;;;/rC19H7Li11N3S5/c20-36-24-35-18-3-1-7-12-11-10-9-6-2-4-32-16(9)33(22-32)14(11)31-15(7)34-23-38(28(18)35)25-37(26-38)21-8(5-6)13(10)19(29(35)37)17(12,18)30(18,19,36)27(19)36/h1-5,8,31H
45 atoms
C  -0.89197907 -1.89201013 -1.47734931
N  -1.94702634 -1.10137124 -1.65192178
C  0.29601978 -1.47921905 -0.83465946
C  -1.86617247 0.19368994 -1.25030265
C  0.39165181 -0.13878638 -0.4305749
C  -0.7075404 0.72475121 -0.65884877
N  -2.97211525 0.92493127 -1.47907242
C  -0.6522276 2.10511678 -0.31601382
C  -2.91973543 2.23357204 -1.13852273
C  -1.83957564 2.85866779 -0.58681792
C  1.60114037 0.33451392 0.1612382
C  1.62894395 1.7192663 0.46245872
C  0.53211723 2.58478963 0.23514048
C  1.37267951 -2.39611159 -0.64798478
C  2.59895086 -1.87848648 -0.1089141
C  2.73038181 -0.53742178 0.34523874
H  0.61783945 3.63156791 0.50391799
H  -1.88841152 3.91330474 -0.34778608
H  -3.82373984 2.80025227 -1.33456961
C  3.70974574 -2.814412 -0.05343847
C  1.21543745 -3.74548137 -1.10194101
N  -0.93994856 -3.1531111 -1.95666816
C  0.08689161 -4.09536195 -1.83626415
C  3.48371649 -4.1741844 -0.34500339
C  2.29900395 -4.65819843 -0.84568258
H  4.30183065 -4.87255816 -0.18701253
H  2.1620914 -5.71840085 -1.01272675
S  -0.06321963 -5.54864033 -2.7864948
H  -1.759113 -3.43069914 -2.47514797
S  5.41238781 -2.21525373 -0.00587304
S  3.35998361 -2.58168808 -3.9620148
H  2.53401846 2.16750542 0.8709447
S  4.56317159 -0.76300464 3.60464807
S  3.91735922 1.00406405 -2.68662029
Li 2.5709357 -0.96476243 -2.43141532
Li 4.3697719 -0.53528111 -4.35056689
Li 2.20211587 2.13869376 -1.71089691
Li 1.92103421 -4.27394678 -3.33282511
Li 5.16456729 -0.63206699 5.7814233
Li 6.20311527 -1.31621184 2.08685123
Li 4.71797467 -3.06441862 -2.15847935
Li 4.55759342 -0.00634532 -0.66694904
Li -3.86218305 -0.71031468 -2.22196868
Li 3.57565539 0.5343755 1.98392597
Li 3.44044995 -1.98531568 1.94633599
energy: -2962.6504525508553
energyOcCorr: -2962.6546512465
s2: 0.80761803
charge: 0.000000
dipole: 792.108496 -789.320391 2.788105 -584.429911 589.619731 5.189819 -398.299322 406.641859 8.342537
quadrupole: 8390.251151 -8455.296082 -65.044931 6228.056423 -6447.513278 -219.456855 4041.667742 -4164.150566 -122.482824 -2850.843493 2854.605103 3.761611 127.509744 -33.285618 94.224126 1925.292636 -1956.655416 -31.362780
temp: 298.15 k
press: 1.0 bar
thermalcorrgfe: 0.169708612486 hartree
thermalcorrener: 0.27189104523 hartree
entropy: 0.90812 kJ.mol-1.K-1
thermalcorrenthalpy: 0.272835627134 hartree
