title: ChemShell job
elementType: c
basis: def2-mSVP
elementType: n
elementType: h
elementType: s
elementType: li
method: uhf
method: dft
functional: pbeh-3c
elementType: c n h s li
basis: def2-mSVP def2-mSVP def2-mSVP def2-mSVP def2-mSVP
frequency: -0.00 -0.00 -0.00 -0.00 -0.00 0.0000 56.09 71.52 79.89 104.01 142.26 182.02 194.38 195.39 206.53 234.17 247.29 248.51 260.61 312.07 319.14 332.33 338.89 345.19 373.16 387.65 411.08 415.46 437.09 490.49 504.11 535.64 537.56 543.54 554.80 570.02 579.19 588.94 598.78 630.61 656.89 683.17 702.74 727.52 734.28 775.20 776.65 779.95 803.10 824.57 830.88 865.98 869.41 887.17 897.13 933.06 952.12 1001.42 1015.95 1029.04 1034.13 1045.09 1134.71 1140.24 1161.00 1173.90 1197.18 1234.56 1246.69 1279.35 1291.91 1302.80 1323.67 1337.90 1350.62 1383.65 1402.97 1439.61 1448.28 1468.74 1476.47 1493.00 1531.65 1537.06 1557.75 1579.82 1595.46 1613.58 1627.68 1676.40 1688.81 1710.63 3190.50 3249.24 3256.86 3267.12 3269.64 3282.83 3636.28
irintensity: 0.00000 0.00000 0.00000 0.00000 0.00000 0 25.02165 21.93602 51.74506 38.92681 40.15047 8.31667 32.52251 9.82405 4.12812 214.40494 72.39073 23.71779 152.60587 5.82653 4.03952 27.42877 29.74157 8.48734 14.92596 212.44450 124.27950 109.31320 1.47114 2.54876 65.75850 0.37403 60.07698 225.60436 0.03510 13.00489 9.06099 26.09526 2.57806 128.13086 23.27838 157.81664 0.17633 23.88809 57.57962 82.66484 1.25904 67.24719 303.50217 31.75577 2.70358 34.09147 1.09647 92.42711 29.58870 83.61737 299.72421 0.04884 0.06028 35.75685 0.05667 262.61097 585.63329 117.41208 287.18923 111.90497 127.10716 1441.87040 1105.63540 79.59616 61.62791 2060.32415 13.02909 17.22074 60.62686 83.83452 154.56802 284.22392 114.24333 909.25067 97.69262 90.43310 85.77306 120.32092 50.38755 96.38013 485.81173 190.99201 378.61599 123.11783 243.63050 1049.97238 149.04747 13.70098 45.88963 54.26144 6.99919 44.27149 163.59134
energy: -1310.974285714 hartree
zeropoint: 0.21774898166 hartree
formula: C19H7Li3N3S
InChI: InChI=1/C19H7N3S.3Li/c23-19-12-3-1-2-10-8-11-5-4-9-6-7-20-17-15(9)14(11)16(13(10)12)18(21-17)22-19;;;/h1,3-7,22H;;;/q-2;;;+2/rC19H7Li3N3S/c26-15-8-3-5-17-19-13(8)12-11-9(18(19)21(17,19)22(17,18)19)2-1-7-4-6-24-16(10(7)11)25(20-24)14(12)23-15/h1-6,23H
33 atoms
C  -1.69558552 -2.19732214 -0.56808057
N  -2.78445678 -1.44865049 -0.40672443
C  -0.39107371 -1.68733817 -0.60038364
C  -2.61538417 -0.11177103 -0.26066472
C  -0.19820922 -0.29943398 -0.45298002
C  -1.33768012 0.50572528 -0.27735258
N  -3.73852276 0.59472674 -0.10643342
C  -1.23471496 1.90020003 -0.12533412
C  -3.63099789 1.93070375 0.04159455
C  -2.4449955 2.61800025 0.04207054
C  1.10499787 0.25135337 -0.48568025
C  1.17570133 1.66795533 -0.32822803
C  0.0690615 2.46018548 -0.15644842
C  0.70051239 -2.54916585 -0.78156239
C  2.01745527 -1.97921173 -0.81306336
C  2.24539159 -0.57212176 -0.66614425
H  0.18260681 3.53150609 -0.04264309
H  -2.44014555 3.69293962 0.16588997
H  -4.56631439 2.46363097 0.16499245
C  3.17753592 -2.81132535 -0.99865899
C  0.50191907 -3.93866312 -0.931058
N  -1.8353743 -3.53996687 -0.71351405
C  -0.83171671 -4.45222264 -0.89346584
C  2.91505461 -4.18327636 -1.14107672
C  1.64573739 -4.75163256 -1.11285409
H  3.74724641 -4.86955522 -1.28488881
H  1.5108916 -5.81964248 -1.22936881
S  -1.25845241 -6.0802177 -1.05377971
H  -2.77576574 -3.91393572 -0.68924934
H  2.15846246 2.12576464 -0.3483329
Li 3.74254053 -1.07139795 -2.11493233
Li 3.94121192 -1.36188981 0.38151561
Li -4.79656526 -1.129415 -0.34561454
energy: -1310.9742857136559
energyOcCorr: -1310.9752370924
s2: 0.82326123
charge: 0.000000
dipole: -123.072465 122.706624 -0.365841 -473.781523 478.733802 4.952279 -185.200979 185.585054 0.384075
quadrupole: 2911.274350 -2939.887545 -28.613195 5606.289322 -5780.635470 -174.346148 323.654135 -428.176852 -104.522717 -442.604952 446.297736 3.692784 -151.502882 148.602115 -2.900768 1073.484108 -1085.658333 -12.174226
temp: 298.15 k
press: 1.0 bar
thermalcorrgfe: 0.17290038520999998 hartree
thermalcorrener: 0.23603502085800002 hartree
entropy: 0.56430 kJ.mol-1.K-1
thermalcorrenthalpy: 0.236979602762 hartree
