title: ChemShell job
elementType: c
basis: def2-TZVPD
elementType: h
elementType: s
method: uhf
method: dft
functional: cam-b3lyp
elementType: c h s
basis: def2-TZVPD def2-TZVPD def2-TZVPD
energy: -2437.227407434 hartree
formula: C22H10S4
InChI: InChI=1/C22H10S4/c1-2-11-6-8-15-20-17(11)13(3-1)10-14-5-4-12-7-9-16-21(18(12)19(14)20)22(15)24-26-25-23-16/h1-10H
36 atoms
C  -1.59305582 -2.6487047 -0.46294895
C  -2.72733569 -1.83490179 -0.49888495
C  -0.29489896 -2.06944776 -0.43541995
H  -3.70740358 -2.29813274 -0.51934394
C  -2.6305847 -0.43825495 -0.51017094
C  -0.17235998 -0.65242893 -0.43612195
C  -1.33531585 0.16273998 -0.47728795
C  -3.76989457 0.39610395 -0.54856594
C  -1.22619386 1.57636382 -0.47761695
C  -3.63985359 1.7755998 -0.55314594
C  -2.38923573 2.37035273 -0.51787094
C  1.11623887 -0.06234399 -0.37985796
C  1.18866686 1.35661185 -0.39312296
C  0.07179999 2.13866176 -0.43814495
C  0.8636599 -2.89805767 -0.41524195
C  2.18251875 -2.31279474 -0.38271196
C  2.26660774 -0.8935699 -0.31046197
H  0.17472798 3.21752563 -0.44686495
H  -2.29418874 3.44933761 -0.51995894
H  -4.75249946 -0.05938599 -0.57356993
H  -4.52746049 2.39529873 -0.58351493
C  3.27297263 -3.22684164 -0.45187295
C  0.69561192 -4.30923851 -0.42153895
C  -1.71379281 -4.06499954 -0.45385495
C  -0.61491693 -4.85840145 -0.43231795
C  3.07096765 -4.61089548 -0.46418395
C  1.81591579 -5.15668542 -0.42546495
H  3.93536255 -5.2614634 -0.51412594
H  1.67995981 -6.23062829 -0.42922795
H  -0.71967292 -5.93673933 -0.42904595
H  -2.70482069 -4.50280149 -0.46717595
S  4.98025643 -2.76620868 -0.51338594
S  5.23614141 -1.90718979 -2.30929874
H  2.15572475 1.83781879 -0.36734396
S  4.61995648 0.20728798 -1.84991779
S  3.80514257 -0.10008199 -0.020415
energy: -2437.2274074335251
energyOcCorr: -2437.2328075255
s2: 0.80874781
charge: -1.000000
dipole: 480.234041 -483.938806 -3.704765 -506.475235 508.280410 1.805175 -263.162063 264.709667 1.547604
quadrupole: 7376.828125 -7551.316591 -174.488466 4742.535680 -4882.051029 -139.515349 620.542452 -765.476556 -144.934104 -2246.912241 2259.207614 12.295373 -1211.629288 1221.129499 9.500211 605.802421 -609.164523 -3.362102
