title: ChemShell job
elementType: c
basis: def2-TZVPD
elementType: h
elementType: s
elementType: li
method: uhf
method: dft
functional: cam-b3lyp
elementType: c h s li
basis: def2-TZVPD def2-TZVPD def2-TZVPD def2-TZVPD
energy: -2444.693542991 hartree
formula: C22H10LiS4
InChI: InChI=1/C22H12S4.Li/c23-25-16-9-7-12-4-5-14-10-13-3-1-2-11-6-8-15-20(17(11)13)19(14)18(12)21(16)22(15)26-24;/h1-10,23-24H;/q;+2/p-2/rC22H10LiS4/c1-2-11-6-8-15-20-17(11)13(3-1)10-14-5-4-12-7-9-16-21(18(12)19(14)20)22(15)25-27-23-26-24-16/h1-10H
37 atoms
C  -1.50445283 -2.57840671 -0.75339291
C  -2.60108471 -1.7520758 -0.69976692
C  -0.18917898 -2.03302677 -0.58904793
H  -3.59109359 -2.17075575 -0.83970291
C  -2.47154472 -0.36888596 -0.46635695
C  -0.037831 -0.66017392 -0.33338196
C  -1.17810187 0.17475898 -0.26365097
C  -3.59124559 0.48331294 -0.41988395
C  -1.04093788 1.55893982 0.007802
C  -3.43819661 1.82794379 -0.17051198
C  -2.16806976 2.36545273 0.04754999
C  1.26851586 -0.11629799 -0.12900199
C  1.36358184 1.28368885 0.19646798
C  0.27318397 2.07447877 0.25014597
C  0.94803989 -2.86673268 -0.69478992
C  2.26300975 -2.31633974 -0.58394594
C  2.38463173 -0.93522589 -0.25130397
H  0.38163496 3.12571465 0.48681395
H  -2.05889177 3.42313961 0.25275297
H  -4.57786748 0.06691399 -0.58019493
H  -4.30514251 2.47356372 -0.13705599
C  3.35059862 -3.20390264 -0.81041191
C  0.76002492 -4.25844652 -0.93387089
C  -1.64883081 -3.98744655 -0.98208389
C  -0.56948994 -4.78665246 -1.05754988
C  3.13880864 -4.55269348 -1.01720888
C  1.85912479 -5.08780642 -1.05925588
H  3.98962455 -5.20351641 -1.17116487
H  1.7228908 -6.1487123 -1.22425486
H  -0.68238492 -5.84991134 -1.22887886
H  -2.6462527 -4.3944535 -1.09258488
S  5.04639243 -2.69590269 -0.9365839
S  5.21271941 -2.04738777 -2.83263568
H  2.33263074 1.7168548 0.39131396
S  3.97466655 -0.23522597 0.11263999
S  4.3983135 0.9360059 -1.48599083
Li 6.43402727 -0.03328199 -2.30527774
energy: -2444.6935429910000
energyOcCorr: -2444.6953336407
s2: 0.75771242
charge: -0.000000
dipole: 549.918141 -549.927516 -0.009375 -484.061860 484.098565 0.036705 -299.749651 299.821148 0.071497
quadrupole: 7713.807286 -7800.436578 -86.629292 4691.509349 -4810.401734 -118.892385 905.913883 -1045.988249 -140.074366 -2174.308536 2182.781844 8.473308 -1655.136718 1649.234808 -5.901910 1237.074203 -1239.171507 -2.097304
