program: Gaussian 09
title: 000076679
version: EM64L-G09RevD.01
frameworkgroup: C1[X(C8H4Cl3N)]
method: RPBEPBE
basis: SDD
operation: Freq
keyword: #p
keyword: freq=noraman
keyword: PBEPBE/SDD
title: #p freq=noraman PBEPBE/SDD
converged: YES YES NO YES
title: Mulliken charges:
elementType: Cl Cl Cl N C C C C C C C C H H H H
charge: 0.020465 -0.020929 0.012050 0.001570 0.676025 -0.256172 -0.581641 -0.324751 -0.101315 -0.210319 -0.212406 -0.104142 0.279544 0.282289 0.269351 0.270381
chargesum: 0.00000
title: Mulliken charges with hydrogens summed into heavy atoms:
elementType: Cl Cl Cl N C C C C C C C C
charge: 0.020465 -0.020929 0.012050 0.001570 0.676025 -0.256172 -0.019809 -0.324751 -0.101315 0.059033 0.057975 -0.104142
polarizability: 1.53599024e+02 4.56000577e+00 1.26223799e+02 1.76333618e+00 -3.37986612e+00 6.25085839e+01
1716.lowfreq: -11.4646 -6.0993 -5.4544 -0.0028 -0.0012 -0.0007 19.5478 58.7008 90.2913
frequency: 19.4190 58.6968 90.2911 119.3095 194.7312 208.7293 262.3801 285.0155 297.1156 314.8841 354.7325 365.3941 453.5066 457.7816 517.8765 547.9278 557.5912 635.3406 733.5145 757.6987 809.0019 858.0559 923.3775 935.4724 945.4523 1049.7183 1128.2658 1157.9751 1196.2416 1222.5955 1308.1174 1359.4713 1378.9626 1423.8335 1438.3133 1558.5601 1580.5378 2205.3920 3014.6202 3073.9003 3169.3332 3187.7311
redmass: 10.8255 16.7300 10.8091 9.8697 26.5015 17.1912 6.8071 5.8185 6.9687 25.6650 11.3211 2.5275 6.7637 5.2807 4.7836 5.9616 7.0331 6.3015 7.3842 8.6533 1.3423 6.6713 2.1224 3.9201 1.3618 7.6105 1.9451 1.7326 1.6891 1.4424 1.4028 8.1842 4.2144 2.6596 1.0832 7.1809 9.4077 12.4452 1.0589 1.1006 1.0892 1.0981
irintensity: 2.8205 1.4526 0.8791 1.4436 0.1396 2.2000 5.5100 4.1071 0.3651 0.1414 4.0274 1.8399 3.5264 9.2013 1.3788 15.5220 16.1564 4.2352 15.0671 20.0478 43.3424 6.7774 19.9884 11.9356 0.0976 58.3000 2.8088 43.3381 6.1419 0.8672 0.3781 2.2410 39.1749 85.9173 27.4486 9.9742 2.5262 5.7642 2.8181 0.6624 0.0392 0.1360
temp: 298.150 k
press: 1.00000 atm
elementType: 17 17 17 7 6 6 6 6 6 6 6 6 1 1 1 1
symmnumber: 1
zpe: 252154.0 jmol-1
zpe.correction: 0.096040 hartree
zpe.thermalcorrener: 0.107466 hartree
zpe.thermalcorrenthalpy: 0.108410 hartree
zpe.thermalcorrgfe: 0.056193 hartree
zpe.sumelectzpe: -1741.315008 hartree
zpe.sumelectthermal: -1741.303583 hartree
zpe.sumelectthermalent: -1741.302639 hartree
zpe.sumelectthermalfe: -1741.354855 hartree
dipole: 0.8864 -3.4438 -2.6371
dipole: 4.4272
quadrupole: -96.1828 -88.5572 -92.9469
quadrupole: 2.6623 7.7604 -9.7773
quadrupole: -3.6205 4.0051 -0.3846 2.6623 7.7604 -9.7773
hfenergy: -1741.4110487 hartree
pointgroup: C01 [X(C8H4Cl3N1)]
dipole: -1.017139 1.0488111 -0.9482983 debye
dipolederiv: -0.075093 0.0670031 0.0223063 0.0311395 -0.6296094 -0.1173262 0.0242953 -0.1298518 -0.0426372 -0.4688678 -0.3402956 0.062583 -0.2999718 -0.4173118 0.0350269 0.0768283 0.0361274 -0.0561614 -0.5303924 -0.2921918 0.0728316 -0.3278319 -0.2507095 0.0411941 0.0845821 0.0400319 -0.0314981 -0.2537045 0.0146651 0.0159555 0.0250758 -0.2157414 -0.011099 -0.0705056 0.0220357 -0.185634 0.0319344 -0.1982585 -0.0076953 -0.1438653 -0.2928923 -0.0171215 0.0046732 -0.0042029 -0.0450093 -0.0695521 -0.1167261 -0.0109962 -0.1671219 0.8851231 0.2183466 -0.0226723 0.1781403 -0.0059946 0.1413231 0.0035499 -0.0274151 0.0018076 0.1202571 0.0233724 -0.0638961 0.0389211 0.0977964 0.6225179 0.5546257 -0.1205871 0.4679956 0.5838881 -0.043573 -0.1127589 -0.0395882 -0.0500598 0.7387072 0.4682379 -0.1144173 0.611803 0.1572218 -0.1208885 -0.1096878 -0.0944889 -0.0278025 -0.1847282 -0.1190918 0.0126225 -0.0954965 -0.0853463 0.0342915 0.0117102 0.0359074 -0.0816347 -0.1311379 -0.0514504 -0.0121936 -0.1117513 -0.0259952 0.0400325 -0.0088209 0.0260135 -0.0797397 -0.030382 -0.0027686 0.1016031 -0.0102087 -0.0086023 -0.051647 0.1792441 -0.0774814 0.0350461 0.0266195 -0.007883 0.0026006 -0.0559644 0.0801407 0.0860762 -0.0248927 0.0342756 0.09151 0.0842676 0.0077955 -0.0598944 0.0528121 0.0347347 -0.0691128 -0.0363625 -0.0157886 0.0714408 0.0891896 -0.009249 0.0162876 0.0051953 -0.0083893 -0.0277982 0.0229548 -0.0281054 0.1591372 0.0092986 0.0220377 0.0464088 0.0163827 0.073232 -0.0197742 0.0453087 -0.0219457 0.1512405 unknown
polarizability: 142.8185182|14.2687839|136.1557916|-7.9939207|3.0357346|63.3570978 unknown
InChI: InChI=1S/C8H4Cl3N/c9-6-1-2-7(10)8(11)5(6)3-4-12/h1-2H,3H2
charge 0 multiplicity 1
16 atoms
Cl -0.54199 -2.515679 -0.584208
Cl 1.607787 2.639438 -0.32829
Cl -3.402288 -1.312508 0.380408
N  3.246763 -1.307755 1.137907
C  0.401746 0.106859 -0.432196
C  -0.723766 -0.743552 -0.259139
C  1.747871 -0.441732 -0.894828
C  0.212477 1.481832 -0.149924
C  -1.969949 -0.23327 0.165966
C  -1.020825 2.008839 0.276208
C  -2.120164 1.142031 0.433695
C  2.574649 -0.922115 0.231541
H  2.310948 0.346075 -1.425908
H  1.596246 -1.281581 -1.595761
H  -1.123701 3.076637 0.484141
H  -3.088004 1.52798 0.76439
