title: ChemShell job
elementType: c
basis: def2-TZVPD
elementType: h
elementType: s
elementType: li
method: uhf
method: dft
functional: cam-b3lyp
elementType: c h s li
basis: def2-TZVPD def2-TZVPD def2-TZVPD def2-TZVPD
energy: -2459.744498970 hartree
formula: C22H10Li3S4
InChI: InChI=1/C22H10S4.3Li/c23-25-16-9-7-12-4-5-14-10-13-3-1-2-11-6-8-15-20(17(11)13)19(14)18(12)21(16)22(15)26-24;;;/h1-10H;;;/rC22H10Li3S4/c23-29-24-28(25-29)26-22-15-8-6-11-2-1-3-13-10-14-5-4-12-7-9-16(27-29)21(22)18(12)19(14)20(15)17(11)13/h1-10H
39 atoms
C  -1.55136383 -2.53955071 -0.67630192
C  -2.6457247 -1.7122318 -0.75471391
C  -0.24271997 -1.98061678 -0.50870794
H  -3.63034759 -2.14305876 -0.8947889
C  -2.52069871 -0.31369297 -0.64933993
C  -0.09625899 -0.58902893 -0.38023096
C  -1.23539286 0.24781897 -0.44426195
C  -3.64175758 0.53486894 -0.71554392
C  -1.10907487 1.64819881 -0.27481697
C  -3.4975906 1.89651078 -0.57692394
C  -2.23675074 2.45292672 -0.35326596
C  1.19090986 -0.03909299 -0.09277199
C  1.27065885 1.37941385 0.14081598
C  0.18828798 2.17748075 0.021215
C  0.8932269 -2.82187568 -0.47894995
C  2.20422975 -2.26600674 -0.34068996
C  2.31039974 -0.8735659 -0.021222
H  0.28897097 3.24544263 0.17251698
H  -2.13641476 3.5236606 -0.22596697
H  -4.62227147 0.10253099 -0.8708419
H  -4.36499551 2.54055271 -0.62920893
C  3.29557163 -3.16121964 -0.53911694
C  0.70535192 -4.22972152 -0.58968593
C  -1.69616781 -3.96371155 -0.76205791
C  -0.61929993 -4.76768146 -0.70914992
C  3.08000065 -4.52488949 -0.62309793
C  1.80453879 -5.06769142 -0.59705993
H  3.92783455 -5.18691441 -0.74520592
H  1.67225581 -6.1400373 -0.65650492
H  -0.72964692 -5.84264334 -0.77333391
H  -2.69069669 -4.3775695 -0.8699309
S  4.96142444 -2.6693767 -0.8863789
S  4.81379945 -1.8083018 -2.81003168
H  2.22668375 1.8188308 0.38377596
S  3.76380557 -0.27103497 0.80055391
S  4.67624847 1.09309488 -0.51521094
Li 3.41262561 0.14925798 -2.32699774
Li 6.30646628 -0.27877197 -1.57412982
Li 5.53126737 -4.04350054 -3.05910166
energy: -2459.7444989698033
energyOcCorr: -2459.7428657271
s2: -0.00000000
charge: 1.000000
dipole: 571.149445 -563.037091 8.112353 -481.026763 475.268793 -5.757969 -264.793315 257.897109 -6.896206
quadrupole: 7925.755200 -7938.198902 -12.443702 4812.662183 -4887.687964 -75.025781 876.002780 -985.140212 -109.137431 -2218.536004 2161.199582 -57.336422 -1186.404838 1124.154829 -62.250010 1011.302912 -982.284426 29.018486
