title: ChemShell job
elementType: c
basis: def2-mSVP
elementType: h
elementType: s
elementType: li
method: uhf
method: dft
functional: pbeh-3c
elementType: c h s li
basis: def2-mSVP def2-mSVP def2-mSVP def2-mSVP
frequency: -0.00 0.0000 0.0000 0.0000 0.0000 0.0000 17.51 22.20 47.60 68.46 90.66 97.71 117.36 135.75 144.57 161.07 184.76 195.65 214.70 217.01 239.17 258.91 268.73 291.04 300.94 302.85 332.57 341.64 354.23 370.94 379.82 391.66 405.43 428.50 435.02 460.09 465.99 485.68 489.37 499.54 519.89 528.43 538.64 546.31 571.88 585.49 619.92 623.28 631.79 644.74 680.59 682.86 715.06 747.58 773.58 784.45 803.83 822.61 839.51 847.15 853.85 881.31 885.61 891.63 928.42 937.75 952.11 972.02 1011.37 1029.53 1031.65 1041.81 1044.54 1070.43 1105.06 1134.17 1139.67 1191.46 1198.02 1209.58 1235.35 1242.99 1276.08 1294.99 1303.50 1319.55 1337.00 1364.38 1377.85 1410.89 1424.59 1446.24 1472.84 1481.09 1493.07 1520.43 1523.44 1560.41 1566.27 1575.08 1620.99 1658.81 1679.40 1691.50 1707.62 1741.74 1745.45 3255.88 3259.22 3260.15 3263.04 3264.14 3268.85 3274.51 3276.79 3286.07 3316.92
irintensity: 0.00000 0 0 0 0 0 0.25859 0.73469 1.11498 0.66750 3.07013 45.84916 0.85209 80.25064 16.34910 6.49183 9.32207 15.33177 10.43251 21.84226 40.23703 7.77739 171.59969 19.13754 0.13432 133.71766 11.89475 24.28400 204.14060 1.18474 45.52943 87.50360 4.46386 13.77120 33.72144 149.66232 4.95167 37.77763 195.54687 5.05992 3.32188 14.60611 0.56443 1.21012 0.24406 15.16650 15.81491 8.12039 7.30449 3.32311 69.97390 28.07983 2.21768 17.00631 2.46487 24.97621 29.88124 4.24511 1.32323 6.36099 94.50472 19.04928 8.12604 38.25220 55.50069 2.83912 29.13261 21.74804 1.38427 4.37603 1.80797 0.12055 2.83415 208.33084 15.81622 99.21121 18.47928 34.92201 12.85764 100.43697 11.78634 1.32451 68.28303 33.55465 2.53115 86.20353 54.11177 13.90194 3.88585 14.88131 24.63503 10.08509 41.70203 9.56986 41.35729 8.11805 35.59824 106.10669 42.34164 43.76863 145.54129 98.74654 13.69692 31.47845 44.93890 20.34213 11.08365 11.30833 1.77234 13.60797 10.12438 2.13960 13.38999 22.27369 29.59953 51.42928 12.58715
energy: -2456.463056603 hartree
zeropoint: 0.2620453024 hartree
formula: C22H10Li3S4
InChI: InChI=1/C22H10S3.3Li.S/c23-16-9-7-12-4-5-14-10-13-3-1-2-11-6-8-15-20(17(11)13)19(14)18(12)21(16)22(15)25-24;;;;/h1-10H;;;;/rC22H10Li3S4/c1-2-11-6-8-15-20-17(11)13(3-1)10-14-5-4-12-7-9-16-21(18(12)19(14)20)22(15)26-29-24-28-23-27(16)25(28)29/h1-10H
39 atoms
C  -1.50546614 -2.54139656 -0.8205904
C  -2.5930741 -1.70538026 -0.9266374
C  -0.20563033 -2.00136638 -0.52786003
H  -3.56586751 -2.12646603 -1.15390993
C  -2.47645884 -0.31447608 -0.74578489
C  -0.06881163 -0.61498841 -0.34777355
C  -1.2011554 0.23164381 -0.44995021
C  -3.58851182 0.54636975 -0.84394284
C  -1.07907019 1.62828446 -0.23616419
C  -3.44517008 1.9007047 -0.64942984
C  -2.19540978 2.44322583 -0.34167603
C  1.20722973 -0.0772767 0.0036138
C  1.28436454 1.34350292 0.23434645
C  0.21035566 2.14719735 0.10758202
C  0.92586018 -2.85047371 -0.41731307
C  2.23571722 -2.31482834 -0.14302536
C  2.31737174 -0.91147221 0.14163875
H  0.31102877 3.21274093 0.2756871
H  -2.09445544 3.50896554 -0.17728047
H  -4.56062772 0.12716932 -1.07261982
H  -4.30572049 2.55186015 -0.72877658
C  3.34850935 -3.23110561 -0.1660291
C  0.72186405 -4.24848999 -0.58413465
C  -1.64794834 -3.95574019 -1.00289208
C  -0.58060891 -4.76589978 -0.88014735
C  3.07133567 -4.59739459 -0.26366542
C  1.80176623 -5.10360329 -0.45855714
H  3.90649657 -5.28487803 -0.22572677
H  1.65838504 -6.17313919 -0.55339352
H  -0.68503176 -5.83647297 -1.00937535
H  -2.62741422 -4.35479913 -1.23502493
S  5.06869674 -2.8581779 -0.20139854
S  4.81037558 -1.36353692 -3.75588798
H  2.23684392 1.77587221 0.49756451
S  3.75008253 -0.19392346 0.90185148
S  4.64795832 0.93704007 -0.62168311
Li 3.49891579 0.11166725 -2.62591532
Li 5.69006266 -0.97397121 -1.62480468
Li 4.58338734 -3.25232865 -2.53653651
energy: -2456.4630566025944
energyOcCorr: -2456.4681583949
s2: -0.00000000
charge: -1.000000
dipole: 573.053814 -582.788644 -9.734830 -481.045843 482.264830 1.218987 -265.485595 267.959592 2.473996
quadrupole: 7752.411844 -7968.059961 -215.648116 4759.721348 -4885.974144 -126.252796 1214.066289 -1396.832039 -182.765751 -2191.873605 2202.885726 11.012121 -1072.323541 1105.548199 33.224658 850.123817 -851.451679 -1.327862
temp: 298.15 k
press: 1.0 bar
thermalcorrgfe: 0.20920965654399998 hartree
thermalcorrener: 0.28524088222 hartree
entropy: 0.67786 kJ.mol-1.K-1
thermalcorrenthalpy: 0.286185464124 hartree
