title: ChemShell job
elementType: c
basis: def2-mSVP
elementType: h
elementType: s
elementType: li
method: uhf
method: dft
functional: pbeh-3c
elementType: c h s li
basis: def2-mSVP def2-mSVP def2-mSVP def2-mSVP
frequency: -58.70 -35.61 -0.00 -0.00 0.0000 0.0000 0.0000 0.0000 26.94 40.01 65.19 76.61 86.96 90.84 110.15 124.19 133.69 146.11 178.51 205.53 211.53 240.04 250.47 266.75 282.41 292.43 294.57 297.79 310.06 330.05 342.74 347.71 356.28 371.53 377.88 380.20 384.64 390.25 413.12 441.91 455.73 485.72 495.35 521.37 535.55 540.46 543.39 572.07 587.62 616.00 623.14 631.85 644.95 677.81 688.65 717.35 748.61 772.43 787.56 806.44 823.61 839.45 848.50 859.76 882.82 888.14 894.40 926.32 936.81 951.83 971.60 1013.63 1034.87 1042.63 1046.16 1050.72 1075.56 1104.29 1135.62 1139.91 1189.99 1197.13 1211.29 1232.14 1242.82 1281.40 1296.69 1301.68 1319.84 1354.91 1370.42 1377.65 1403.40 1427.76 1448.95 1471.81 1483.22 1496.33 1518.00 1522.75 1557.72 1570.34 1575.35 1629.09 1660.26 1679.16 1688.75 1703.99 1740.72 1744.24 3259.44 3262.09 3263.34 3263.39 3264.09 3268.24 3279.31 3280.22 3285.58 3299.59
irintensity: 0.00000 0.00000 0.00000 0.00000 0 0 0 0 5.72853 23.02889 5.67579 8.44734 63.20938 72.27621 42.89389 1.94394 38.79220 4.42285 9.03259 18.37966 10.76128 34.68371 13.89594 15.93165 70.46790 123.71094 169.20499 96.01061 5.87594 14.24307 65.38134 67.49561 80.01211 149.92913 51.05063 62.66196 181.34517 31.88569 169.45501 56.53492 6.89051 12.64354 19.36139 6.45186 5.06886 5.31288 4.91480 3.02661 16.60586 26.10181 11.20544 4.72061 7.68630 2.39580 4.96917 24.70897 25.45142 0.71744 14.02797 37.13962 23.06761 2.14027 20.72086 57.80494 61.90893 18.34939 34.93245 52.89407 43.33564 48.51841 15.35489 0.56736 22.75350 2.24860 0.54622 0.78437 7.20701 22.68813 64.84708 55.03568 4.49854 9.63048 48.18598 2.99533 3.21638 53.88373 61.36811 5.70053 42.36996 221.32423 59.01048 7.71536 5.05455 18.58845 30.60429 11.32484 18.93371 44.88847 24.04264 135.34113 104.60515 14.66985 23.37670 3.09114 71.88094 8.33539 9.07383 27.30187 49.57259 28.89212 9.15886 1.10469 13.58627 7.68117 0.34014 9.51031 4.77760 28.10359 52.98618 11.86894
energy: -2463.735252150 hartree
zeropoint: 0.26246427018 hartree
formula: C22H10Li4S4
InChI: InChI=1/C22H10S3.4Li.S/c23-22-15-8-6-11-2-1-3-13-10-14-5-4-12-7-9-16(25-24)21(22)18(12)19(14)20(15)17(11)13;;;;;/h1-10H;;;;;/rC22H10Li4S4/c23-30-24-29-25-27(26(29)30)22-15-8-6-11-2-1-3-13-10-14-5-4-12-7-9-16(28(25)30)21(22)18(12)19(14)20(15)17(11)13/h1-10H
40 atoms
C  -1.61419751 -2.5888534 -0.48190185
C  -2.74973519 -1.81491529 -0.48969674
C  -0.32105936 -1.97242308 -0.46097925
H  -3.72209858 -2.29288494 -0.51876674
C  -2.6773718 -0.40733795 -0.46537085
C  -0.22213667 -0.57290223 -0.40055805
C  -1.40250514 0.21494418 -0.40164165
C  -3.83390327 0.39593045 -0.49038574
C  -1.32415085 1.62973652 -0.32787176
C  -3.73608218 1.7680644 -0.44219935
C  -2.48762222 2.38622083 -0.35321446
C  1.06056358 0.03977639 -0.27163267
C  1.09371838 1.47490043 -0.16945688
C  -0.0257452 2.22624825 -0.22075877
C  0.8553016 -2.75543559 -0.51643434
C  2.15123515 -2.13956766 -0.49961015
C  2.23035925 -0.73265562 -0.21527157
H  0.045888 3.30617693 -0.17355148
H  -2.42188323 3.46645581 -0.30123717
H  -4.80488936 -0.08043119 -0.54558054
H  -4.63250997 2.37377503 -0.46459455
C  3.25450173 -3.00412476 -0.76854181
C  0.71812822 -4.17336893 -0.58553444
C  -1.69958171 -4.02058085 -0.50283354
C  -0.58613983 -4.77279706 -0.55296954
C  3.08649675 -4.3768946 -0.842726
C  1.84236159 -4.96904973 -0.69671762
H  3.94514365 -5.00570483 -1.04224548
H  1.7465838 -6.04646762 -0.73695062
H  -0.65088723 -5.85343944 -0.57806113
H  -2.6787225 -4.48276509 -0.48491594
S  4.91952804 -2.52110602 -1.15405807
S  4.74138656 -1.31347955 -2.86295108
H  2.05399157 1.95952548 -0.07224859
S  3.68186348 0.05940939 0.36750066
S  7.14138799 -0.0013597 -0.99674079
Li 4.87180235 0.79782771 -1.54397643
Li 5.74030315 -1.07892168 0.66982592
Li 5.08243433 -3.5275876 -3.62416679
Li 7.0773848 -0.48285144 -3.32115483
energy: -2463.7352521502971
energyOcCorr: -2463.7338159770
s2: 0.75506151
charge: 1.000000
dipole: 655.012707 -643.107023 11.905684 -481.777259 476.536192 -5.241067 -309.262117 301.517416 -7.744701
quadrupole: 10170.911985 -10150.338868 20.573117 4489.755021 -4565.539040 -75.784018 1022.631352 -1107.953845 -85.322494 -2200.819220 2150.068671 -50.750549 -1885.444267 1799.351280 -86.092987 981.726298 -950.691897 31.034401
temp: 298.15 k
press: 1.0 bar
thermalcorrgfe: 0.210081871286 hartree
thermalcorrener: 0.28620450811399994 hartree
entropy: 0.67868 kJ.mol-1.K-1
thermalcorrenthalpy: 0.287149090018 hartree
