title: ChemShell job
elementType: c
basis: def2-mSVP
elementType: h
elementType: s
elementType: li
method: uhf
method: dft
functional: pbeh-3c
elementType: c h s li
basis: def2-mSVP def2-mSVP def2-mSVP def2-mSVP
frequency: 0.0000 0.0000 0.0000 0.0000 0.0000 0.0000 18.86 35.68 54.31 60.46 74.75 87.26 105.72 120.75 133.21 148.18 154.84 177.13 185.62 208.67 213.87 229.23 250.49 265.25 286.09 293.61 308.48 313.96 324.57 342.11 346.39 371.54 378.00 384.13 395.08 396.28 409.77 436.88 444.63 456.40 482.42 485.82 496.90 521.65 536.35 542.08 543.10 572.23 586.64 615.61 623.99 631.85 645.55 677.54 688.01 717.91 747.64 770.32 788.00 804.99 824.87 838.62 848.26 857.71 883.15 887.16 892.14 922.64 937.36 948.62 967.52 1009.98 1037.02 1040.90 1045.37 1048.69 1076.89 1104.15 1135.41 1140.41 1189.24 1195.94 1211.04 1231.19 1242.14 1280.75 1296.40 1301.31 1320.61 1357.59 1371.83 1378.11 1404.20 1428.45 1449.33 1471.77 1483.53 1497.17 1518.57 1522.01 1557.84 1570.09 1576.30 1629.35 1660.85 1679.08 1689.01 1703.97 1740.32 1743.64 3256.76 3261.78 3261.85 3262.27 3262.97 3267.74 3277.41 3278.70 3285.00 3297.19
irintensity: 0 0 0 0 0 0 39.46992 8.20823 31.54987 10.07128 18.02733 28.62192 49.84035 53.53174 1.77444 6.37829 65.00293 23.04854 10.14667 4.58713 3.64995 95.67000 25.05922 30.52830 89.64310 9.60682 57.67892 58.25056 268.86918 38.00260 23.69287 14.22540 51.28163 86.25779 196.73618 65.84529 99.84779 32.16473 207.99047 3.34317 150.89501 40.47312 13.59237 6.55757 3.22587 3.33923 9.95637 3.46638 17.06070 35.58597 12.52546 4.10638 9.64077 4.58656 5.19862 27.67314 27.90778 0.52032 14.77161 37.40260 36.65623 2.76775 19.45333 53.75541 53.74079 31.79470 33.33394 53.74175 44.49062 49.18679 17.87312 0.97669 27.71543 2.43680 0.69228 0.92369 0.50264 30.52969 103.50087 44.13563 5.60193 9.94685 77.47050 2.80656 3.92993 68.57007 58.86678 6.69436 38.29832 200.71049 57.40035 14.92316 29.20334 14.69506 47.74891 30.65374 24.44856 36.85496 8.30906 172.66846 86.00699 7.64886 32.89197 22.62828 32.66002 28.04555 21.46951 23.59446 106.56393 3.04718 9.24704 2.77180 8.45051 7.25907 2.27101 14.91582 13.71457 23.59039 55.38997 12.71849
energy: -2463.907061933 hartree
zeropoint: 0.26368308554 hartree
formula: C22H10Li4S4
InChI: InChI=1/C22H10S3.4Li.S/c23-22-15-8-6-11-2-1-3-13-10-14-5-4-12-7-9-16(25-24)21(22)18(12)19(14)20(15)17(11)13;;;;;/h1-10H;;;;;/rC22H10Li4S4/c23-30-24-29-25-27(26(29)30)22-15-8-6-11-2-1-3-13-10-14-5-4-12-7-9-16(28(25)30)21(22)18(12)19(14)20(15)17(11)13/h1-10H
40 atoms
C  -1.62893381 -2.5873574 -0.46323885
C  -2.75151929 -1.7942504 -0.45682205
C  -0.32695096 -1.99153887 -0.46055925
H  -3.73255118 -2.25528994 -0.47231135
C  -2.654552 -0.38810176 -0.43439515
C  -0.20236218 -0.59345883 -0.40852835
C  -1.36881825 0.21403637 -0.39733766
C  -3.79815837 0.43379685 -0.43447275
C  -1.26539446 1.62805732 -0.33525766
C  -3.67685298 1.80427889 -0.39498535
C  -2.41715172 2.40295663 -0.34173056
C  1.09070668 -0.000372 -0.29925377
C  1.15057527 1.43374034 -0.21421988
C  0.0440412 2.20490325 -0.25584047
C  0.83630581 -2.79123049 -0.53783294
C  2.13848206 -2.19281735 -0.55014544
C  2.24977855 -0.79046221 -0.25047167
H  0.13382308 3.28410713 -0.22354028
H  -2.33341704 3.4820092 -0.29925167
H  -4.77784506 -0.0271667 -0.46297285
H  -4.56372348 2.42433282 -0.39754835
C  3.22152974 -3.06165845 -0.8662326
C  0.68120242 -4.20644192 -0.60462683
C  -1.7344205 -4.01823914 -0.48694055
C  -0.63158393 -4.78630496 -0.54871254
C  3.03977576 -4.4320527 -0.93834549
C  1.7949419 -5.01207303 -0.74785722
H  3.88361496 -5.06697003 -1.17828617
H  1.68790781 -6.08852861 -0.78769511
H  -0.71298932 -5.86596244 -0.57467734
H  -2.71981569 -4.46704969 -0.46149925
S  4.86222845 -2.57328521 -1.33527115
S  4.62927948 -1.29860945 -2.98250716
H  2.12256086 1.89913618 -0.13969958
S  3.71574148 -0.04953509 0.34348516
S  7.22711768 0.45389835 -0.8636592
Li 5.01508693 0.76401781 -1.50755343
Li 5.91651073 -1.03484258 0.30845926
Li 4.97405583 -3.48159231 -3.79028897
Li 7.0472168 -0.65304793 -2.82271238
energy: -2463.9070619326926
energyOcCorr: -2463.9094461728
s2: -0.00000000
charge: -0.000000
dipole: 656.755480 -656.960105 -0.204625 -477.204827 471.056501 -6.148326 -318.244837 312.557712 -5.687125
quadrupole: 10142.833859 -10289.455523 -146.621664 4561.736397 -4646.568357 -84.831960 1057.467699 -1159.932527 -102.464828 -2020.394301 1954.599302 -65.794999 -1927.913453 1868.878091 -59.035362 1034.390344 -999.698814 34.691530
temp: 298.15 k
press: 1.0 bar
thermalcorrgfe: 0.20948008120199998 hartree
thermalcorrener: 0.28848597811599996 hartree
entropy: 0.70404 kJ.mol-1.K-1
thermalcorrenthalpy: 0.28943056002 hartree
