program: Gaussian 09
title: 000004553
version: EM64L-G09RevD.01
frameworkgroup: C1[X(C13H18N2O5S)]
method: RPBEPBE
basis: SDD
operation: Freq
keyword: #p
keyword: freq=noraman
keyword: PBEPBE/SDD
title: #p freq=noraman PBEPBE/SDD
converged: YES YES NO NO
title: Mulliken charges:
elementType: S O O O O O N N C C C C C C C C C C C C C H H H H H H H H H H H H H H H H H H
charge: 0.973034 -0.324087 -0.524400 -0.518357 -0.206965 -0.219689 -0.539467 0.017488 0.034422 -0.455115 -0.440790 -0.398179 -0.398002 -0.390063 0.363519 0.128190 -0.481307 -0.221899 0.399212 -0.406854 -0.728668 0.208298 0.205330 0.231381 0.233334 0.210683 0.213679 0.200512 0.202031 0.212405 0.209441 0.193994 0.301715 0.259411 0.321946 0.289466 0.281037 0.276734 0.286579
chargesum: 0.00000
title: Mulliken charges with hydrogens summed into heavy atoms:
elementType: S O O O O O N N C C C C C C C C C C C C C
charge: 0.973034 -0.324087 -0.524400 -0.518357 -0.206965 -0.219689 -0.217522 0.017488 0.242719 -0.018404 0.003227 0.016012 0.016435 0.013372 0.363519 0.128190 -0.179592 0.037512 0.399212 -0.117388 0.115682
polarizability: 2.82658947e+02 -4.63548399e+01 2.97961867e+02 8.38379626e+00 -2.01112321e+00 1.32202662e+02
1716.lowfreq: -6.7841 -4.6321 -0.0008 0.0008 0.0016 5.9003 21.8183 24.2675 40.0302
frequency: 21.7559 24.2416 40.0135 44.4767 53.0490 59.8014 69.4251 116.9535 130.0502 140.9684 150.4161 158.5154 187.0155 196.0125 219.1553 229.8935 244.5160 272.8984 288.1194 318.5697 320.4709 345.0016 374.7701 385.5542 420.0728 428.3284 449.5475 471.4925 485.8058 513.7352 550.4243 562.0929 586.2552 601.0023 631.8713 695.2167 736.8443 746.8937 784.6157 791.2824 796.9694 808.9635 830.4621 842.6334 878.6266 885.3598 888.2265 894.9455 901.2662 917.0733 925.0310 957.2690 966.8649 982.3363 1000.0391 1025.0589 1043.2698 1054.3710 1076.8021 1082.4584 1109.2394 1114.5086 1148.9751 1189.2924 1197.5019 1205.8640 1239.8058 1240.9329 1243.2685 1255.5320 1260.0162 1293.2779 1306.0355 1312.6912 1315.1835 1330.8955 1338.8796 1342.1805 1351.5137 1360.3908 1367.6677 1412.6870 1413.6458 1417.0100 1435.2202 1463.1931 1464.5393 1466.2265 1468.9105 1472.9827 1483.2589 1575.0992 1597.9500 2971.2801 2973.8291 2974.8456 2976.2890 2989.3927 2994.5165 3037.8339 3038.9789 3041.5144 3048.3447 3054.8761 3064.8004 3176.7066 3185.2285 3190.4834 3195.6901 3198.0231 3314.0329
redmass: 5.9845 5.6895 6.2090 5.3516 3.3548 7.1108 7.2498 7.5871 3.5213 3.0910 3.7826 1.4484 4.3487 4.5759 2.6117 3.3810 4.1926 4.9040 5.1105 4.9577 2.3685 8.0119 5.8117 7.4017 3.1794 3.5625 2.5440 3.0147 4.4651 2.5463 5.5341 6.0002 7.0355 4.3668 6.8272 5.6173 4.0475 9.4749 1.4806 2.4345 4.8696 9.8452 1.5782 2.2516 1.7808 2.0375 2.1166 1.9454 1.8837 1.4941 1.7651 4.4069 1.3648 1.2951 2.8693 1.8368 1.8697 1.1334 1.9235 1.3336 2.5312 1.7643 2.2854 1.8644 1.6761 5.5610 1.5934 1.5068 2.4549 1.3057 1.4121 1.3001 1.3375 1.2772 1.2042 1.3597 1.4503 1.4692 1.4702 10.4448 1.4648 1.0536 3.3267 1.1662 3.5352 1.0963 1.0927 1.2017 2.4991 1.0858 1.1051 7.2497 7.1137 1.0760 1.0714 1.0641 1.0641 1.0609 1.0626 1.0249 1.0960 1.0973 1.1002 1.1030 1.1030 1.0894 1.1075 1.0913 1.1074 1.0968 1.0730
irintensity: 5.2790 0.8841 0.1775 0.2348 0.3246 0.9132 0.3613 6.8087 1.7467 9.6513 6.9578 7.2734 4.0875 12.5616 0.2510 1.7304 2.7593 2.3843 6.7684 52.9642 9.6207 13.6525 4.6720 26.7312 1.8191 10.2911 2.3344 5.3397 6.5568 0.8145 0.3731 6.5354 51.2738 39.9855 9.8860 19.4772 1.4356 23.5312 0.9388 2.2110 12.7968 51.0622 32.5040 9.1429 6.7348 79.8771 33.1315 12.9967 13.5547 76.4850 0.7931 98.9078 9.4201 41.7512 101.7183 23.1297 2.8232 1.8799 41.7964 3.2287 4.3602 31.6094 2.2571 144.5390 33.4157 477.6344 40.9911 6.1991 102.8864 9.0979 37.2932 25.3023 15.2922 3.7859 5.0781 2.9298 5.6148 0.7757 6.4853 100.9414 12.5389 12.8688 66.2651 31.9138 87.2043 6.6250 15.3557 11.6473 119.6158 17.2409 4.5453 12.3969 69.8527 14.2160 17.4982 23.7266 43.0232 8.2622 34.6353 0.1506 64.0263 53.2943 20.6261 25.9945 63.6455 1.9550 0.1849 3.1325 0.4087 2.7368 45.1383
temp: 298.150 k
press: 1.00000 atm
elementType: 16 8 8 8 8 8 7 7 6 6 6 6 6 6 6 6 6 6 6 6 6 1 1 1 1 1 1 1 1 1 1 1 1 1 1 1 1 1 1
symmnumber: 1
zpe: 790888.3 jmol-1
zpe.correction: 0.301233 hartree
zpe.thermalcorrener: 0.322885 hartree
zpe.thermalcorrenthalpy: 0.323829 hartree
zpe.thermalcorrgfe: 0.248066 hartree
zpe.sumelectzpe: -1388.018667 hartree
zpe.sumelectthermal: -1387.997016 hartree
zpe.sumelectthermalent: -1387.996071 hartree
zpe.sumelectthermalfe: -1388.071834 hartree
dipole: -0.7402 -5.7123 4.2844
dipole: 7.1787
quadrupole: -111.1739 -158.0704 -135.7316
quadrupole: 5.7244 14.3335 -3.0849
quadrupole: 23.8181 -23.0784 -0.7396 5.7244 14.3335 -3.0849
hfenergy: -1388.3199006 hartree
pointgroup: C01 [X(C13H18N2O5S1)]
dipole: 1.4479546 1.7562401 1.6720753 debye
polarizability: 245.7191913|-17.650889|332.1336339|-15.7095014|16.9804765|134.9706512 unknown
InChI: InChI=1S/C13H18N2O5S/c1-21(18,19)14-12-8-7-10(15(16)17)9-13(12)20-11-5-3-2-4-6-11/h7-9,11,14H,2-6H2,1H3
charge 0 multiplicity 1
39 atoms
S  -2.041561 3.172192 -0.046029
O  1.163043 0.565314 0.199762
O  -0.996674 4.093991 -0.894029
O  -3.267775 2.388826 -0.774563
O  -2.585495 -4.196655 -0.393844
O  -0.349676 -4.204435 -0.855737
N  -1.045124 1.833692 1.128506
N  -1.43319 -3.615098 -0.460266
C  2.435206 0.001286 -0.354599
C  3.272329 1.210455 -0.793933
C  3.164121 -0.846645 0.705183
C  4.643102 0.741743 -1.344199
C  4.532395 -1.32384 0.152719
C  5.398883 -0.129173 -0.3117
C  0.009746 -0.209475 0.23557
C  -1.158223 0.49714 0.70644
C  -0.083231 -1.561254 -0.139173
C  -2.403908 -0.183974 0.767447
C  -1.344641 -2.194178 -0.061235
C  -2.510344 -1.529205 0.381103
C  -2.76372 4.236086 1.353125
H  2.177233 -0.616198 -1.240757
H  3.425538 1.870511 0.082454
H  2.718673 1.791869 -1.553264
H  2.550439 -1.712598 1.014569
H  3.321893 -0.218269 1.60377
H  5.247878 1.62471 -1.622837
H  4.487504 0.157179 -2.274272
H  4.366565 -2.012403 -0.701331
H  5.059612 -1.906416 0.931043
H  6.348779 -0.495183 -0.745348
H  5.664857 0.493007 0.567413
H  0.767681 -2.141368 -0.500877
H  -3.282977 0.36358 1.11615
H  -0.061014 2.161412 1.016817
H  -3.459235 -2.06824 0.417331
H  -3.357086 3.556544 1.977501
H  -1.909308 4.662103 1.895175
H  -3.373996 5.004167 0.857814
