title: ChemShell job
elementType: c
basis: def2-mSVP
elementType: h
elementType: s
elementType: li
method: uhf
method: dft
functional: pbeh-3c
elementType: c h s li
basis: def2-mSVP def2-mSVP def2-mSVP def2-mSVP
frequency: -0.00 0.0000 0.0000 0.0000 0.0000 0.0000 17.55 33.73 48.20 56.55 67.42 79.43 87.63 103.73 121.37 139.86 149.41 166.34 172.08 177.76 193.28 198.66 222.39 233.13 255.69 286.26 293.18 297.11 310.70 321.84 334.81 347.66 358.40 365.79 368.73 380.05 387.67 399.51 412.73 417.35 423.21 435.50 446.36 461.81 483.32 496.68 516.29 522.26 539.68 544.50 571.25 583.54 608.05 613.19 627.75 643.49 674.78 681.92 712.92 746.37 765.25 787.25 806.21 822.07 833.11 849.65 856.75 877.63 883.55 887.60 924.75 939.27 957.01 978.01 994.03 1031.32 1042.09 1044.06 1052.69 1078.34 1102.85 1133.89 1139.73 1188.40 1195.32 1208.35 1231.30 1241.31 1284.54 1297.45 1302.89 1326.16 1343.96 1372.26 1378.97 1428.07 1433.43 1448.80 1474.55 1486.39 1499.18 1517.56 1521.73 1561.78 1568.52 1576.67 1624.69 1659.62 1678.27 1692.80 1704.03 1736.38 1744.35 3254.81 3257.99 3263.21 3264.06 3266.51 3270.72 3270.91 3281.05 3287.90 3301.15
irintensity: 0.00000 0 0 0 0 0 19.35486 30.85231 23.32056 38.23128 4.53017 63.66397 13.66158 10.05325 20.30533 16.31948 67.50699 36.27173 37.79059 35.04463 49.98415 65.14083 5.13432 39.13030 2.44118 26.46331 43.76069 249.52582 34.83508 184.70302 12.83932 84.20092 62.27785 31.96638 85.64330 25.89803 14.37644 14.80732 205.30433 164.00544 48.54920 31.12915 451.52866 31.85047 18.33713 22.84926 12.86987 15.20079 4.72553 9.74886 2.36992 12.09185 24.16315 36.15211 5.79206 4.96894 80.37708 29.46506 0.98006 26.38716 10.08376 20.16400 42.84198 3.56877 7.53694 4.51367 73.98756 32.79105 43.01753 20.73677 27.66385 5.61720 47.80812 14.50917 4.96902 10.26544 1.26911 2.05535 0.81617 73.84099 16.72319 47.69542 29.13844 18.53538 15.57831 48.80887 13.08456 2.39442 29.95581 15.75694 23.89089 42.39833 38.82853 8.60382 6.51822 1.70663 28.58480 3.33303 5.88803 8.25360 20.92589 4.95940 14.54154 85.85370 5.13854 21.41996 52.31034 14.34679 22.59226 18.55293 18.31602 6.65143 0.72793 26.69925 8.87740 3.18878 1.60652 9.46544 5.30488 20.89125 21.57986 45.11676 7.03753
energy: -2471.358082024 hartree
zeropoint: 0.2650923408 hartree
formula: C22H10Li5S4
InChI: InChI=1/C22H10S3.5Li.S/c23-16-9-7-12-4-5-14-10-13-3-1-2-11-6-8-15-20(17(11)13)19(14)18(12)21(16)22(15)25-24;;;;;;/h1-10H;;;;;;/rC22H10Li5S4/c23-31-24-28-16-9-7-12-4-5-14-10-13-3-1-2-11-6-8-15-20(17(11)13)19(14)18(12)21(16)22(15)29(27(28)31)30(25-31)26-31/h1-10H
41 atoms
C  -1.56605618 -2.41679662 -0.98819886
C  -2.70942917 -1.68806249 -0.75478336
C  -0.28783389 -1.83871593 -0.70066867
H  -3.67737244 -2.14123232 -0.93650334
C  -2.65372773 -0.358216 -0.29241433
C  -0.20675534 -0.50307778 -0.27900606
C  -1.38776639 0.25064608 -0.09608597
C  -3.81931691 0.39754096 -0.0547968
C  -1.31682434 1.61955099 0.26916686
C  -3.73330421 1.71318766 0.33704118
C  -2.48722985 2.3291229 0.48593688
C  1.07863012 0.1086551 -0.11667742
C  1.11063545 1.51970619 0.16818525
C  -0.01969305 2.22495999 0.3770741
C  0.88627302 -2.62339729 -0.80701129
C  2.14292512 -2.08138367 -0.40960884
C  2.22265983 -0.66453177 -0.24522811
H  0.03952776 3.27705846 0.6280249
H  -2.43342787 3.37306722 0.77108252
H  -4.78697928 -0.06687523 -0.19717859
H  -4.63502539 2.28319586 0.517454
C  3.22576245 -2.99251168 -0.19055216
C  0.78667377 -3.96196232 -1.26965105
C  -1.61910801 -3.75689488 -1.50107125
C  -0.49381024 -4.48319968 -1.65268088
C  3.10706196 -4.27724677 -0.72154852
C  1.93148554 -4.74231256 -1.29516763
H  3.92707203 -4.97424939 -0.59933513
H  1.88816802 -5.75498484 -1.67732991
H  -0.54163296 -5.49524262 -2.03557195
H  -2.58417287 -4.17458418 -1.75762898
S  4.54243129 -2.67785256 0.93452762
S  6.52089981 -2.1014887 -2.13338885
H  2.06906741 2.0103964 0.25334226
S  3.74619835 0.19552789 -0.57141889
S  3.67108898 0.28200203 -2.67287701
Li 4.21438631 -2.08924681 -2.58404377
Li 6.06987943 -0.00540836 -3.09105296
Li 6.27991146 -3.68526371 -0.43361772
Li 7.92145837 -3.31785077 -3.48321059
Li 5.8122154 -0.99882295 -0.14205315
energy: -2471.3580820243574
energyOcCorr: -2471.3557264751
s2: -0.00000000
charge: 1.000000
dipole: 644.389654 -629.290824 15.098830 -506.695959 500.279081 -6.416878 -309.447641 302.587841 -6.859801
quadrupole: 9600.464418 -9489.436616 111.027802 4542.353016 -4616.146848 -73.793832 1356.518945 -1459.965321 -103.446376 -2995.270849 2906.461724 -88.809125 -1949.025970 1856.603216 -92.422754 1249.264961 -1201.721270 47.543691
temp: 298.15 k
press: 1.0 bar
thermalcorrgfe: 0.208908761502 hartree
thermalcorrener: 0.29158253088999997 hartree
entropy: 0.73633 kJ.mol-1.K-1
thermalcorrenthalpy: 0.29252711279399995 hartree
