title: ChemShell job
elementType: c
basis: def2-TZVPD
elementType: h
elementType: s
elementType: li
method: uhf
method: dft
functional: cam-b3lyp
elementType: c h s li
basis: def2-TZVPD def2-TZVPD def2-TZVPD def2-TZVPD
energy: -2061.635852013 hartree
formula: C22H10Li3S3
InChI: InChI=1/C22H10S3.3Li/c23-22-15-8-6-11-2-1-3-13-10-14-5-4-12-7-9-16(25-24)21(22)18(12)19(14)20(15)17(11)13;;;/h1-10H;;;/rC22H10Li3S3/c1-2-11-6-8-15-20-17(11)13(3-1)10-14-5-4-12-7-9-16-21(19(12)18(14)20)22(15)25-26(16)27-23-28(22,25)24-27/h1-10H
38 atoms
C  -1.66670781 -2.51691372 -0.65471092
C  -2.78686869 -1.72532281 -0.39386995
C  -0.36659196 -1.93131078 -0.65491993
H  -3.76845957 -2.18581675 -0.38188996
C  -2.67408869 -0.34817696 -0.15305798
C  -0.22967997 -0.53470094 -0.44103895
C  -1.38176784 0.25927797 -0.19332898
C  -3.79806257 0.46408795 0.10891299
C  -1.26304585 1.65850581 -0.00461
C  -3.65814658 1.8269208 0.31133396
C  -2.41085273 2.42943873 0.25275797
C  1.05168288 0.06734399 -0.53713194
C  1.12996487 1.47830383 -0.37239396
C  0.03028099 2.23504975 -0.10180199
C  0.78129891 -2.73508569 -0.8607819
C  2.09618676 -2.14504876 -0.81532491
C  2.19695375 -0.73509492 -0.80277791
H  0.13604698 3.30497162 0.035642
H  -2.31085074 3.4980396 0.39895795
H  -4.77935846 0.006517 0.14344698
H  -4.53552648 2.42959472 0.51037794
C  3.21046263 -3.05907665 -0.81339291
C  0.62169693 -4.12082653 -1.12953987
C  -1.7843458 -3.90434256 -0.9250989
C  -0.68218792 -4.66853447 -1.16781787
C  3.00683966 -4.4199115 -1.13039887
C  1.7614458 -4.93575044 -1.33834185
H  3.87283856 -5.07070342 -1.17206887
H  1.63135381 -5.98130532 -1.58851382
H  -0.79227191 -5.72607835 -1.37765785
H  -2.77135269 -4.35136651 -0.93923489
S  4.68554147 -2.72745169 0.09665299
S  6.27032329 -2.47974172 -1.29498785
H  2.09556976 1.95752878 -0.45580295
S  3.67154658 0.10590299 -1.36824585
Li 4.3519845 -1.89585578 -2.62037471
Li 6.03683731 -0.19333498 -0.8776609
Li 3.70427258 -0.56815993 0.93906089
energy: -2061.6358520132894
energyOcCorr: -2061.6387459180
s2: 0.81853151
charge: -0.000000
dipole: 423.681782 -418.980323 4.701460 -502.437417 504.362311 1.924895 -235.219911 235.786880 0.566969
quadrupole: 7352.539633 -7448.278891 -95.739258 4632.261538 -4775.749733 -143.488195 560.262794 -682.453534 -122.190740 -2573.378150 2596.184680 22.806530 -1120.700559 1118.608755 -2.091804 1104.322786 -1099.912929 4.409857
