title: ChemShell job
elementType: c
basis: def2-mSVP
elementType: h
elementType: s
elementType: li
method: uhf
method: dft
functional: pbeh-3c
elementType: c h s li
basis: def2-mSVP def2-mSVP def2-mSVP def2-mSVP
frequency: -0.00 -0.00 -0.00 0.0000 0.0000 0.0000 55.32 60.44 83.51 108.20 175.51 196.56 208.45 217.29 240.00 297.31 303.40 306.52 318.54 343.07 353.68 356.37 362.45 386.36 414.53 428.95 444.29 483.78 495.45 522.56 534.45 540.92 570.85 583.26 594.19 596.58 631.12 637.01 639.92 688.12 717.36 750.51 777.16 781.47 805.65 807.52 837.16 837.94 858.75 871.94 887.04 900.18 929.02 932.90 946.71 960.49 1020.10 1030.10 1037.99 1043.88 1049.25 1052.96 1097.61 1127.65 1128.68 1165.33 1191.96 1206.01 1228.10 1235.88 1277.14 1293.20 1300.19 1312.51 1348.46 1363.19 1379.36 1416.23 1426.65 1436.37 1469.23 1481.70 1489.76 1512.46 1516.15 1551.93 1565.97 1574.10 1619.07 1649.12 1675.13 1688.14 1701.83 1737.43 1738.67 3204.60 3243.14 3251.99 3253.47 3258.56 3259.49 3264.73 3270.23 3281.55 3288.76
irintensity: 0.00000 0.00000 0.00000 0 0 0 25.93959 6.89928 37.17275 6.92324 1.59710 0.25076 147.92364 6.78347 112.77709 0.60372 27.67837 0.09738 34.05262 39.51349 11.83702 87.31605 2.24139 119.74074 128.70433 19.70009 14.58312 13.59511 16.23690 1.16683 11.36486 7.63640 5.83524 40.83128 49.09108 15.71013 7.11549 4.79193 3.71038 3.99006 21.72301 21.76892 0.18544 2.65985 45.86950 27.20908 127.66306 0.56065 58.93534 86.56060 4.73522 4.01179 103.55546 45.80225 12.44625 22.41407 0.72894 11.47877 3.00360 0.00937 24.89023 0.09257 45.09357 125.29616 21.37356 2.72664 0.68394 89.34431 38.56249 33.05181 96.92532 14.23858 8.03781 6.07937 103.82532 33.35861 26.62953 229.71147 67.09234 37.71871 82.88892 12.84795 21.16284 21.12949 101.21130 15.44011 25.78164 55.92261 104.97928 20.39867 34.71744 28.72795 37.93854 15.36743 249.32094 106.60029 59.60095 12.83705 2.16567 8.99872 2.64066 18.36271 34.83418 57.92199 16.90492
energy: -1255.439037351 hartree
zeropoint: 0.25408491458 hartree
formula: C22H10Li2S
InChI: InChI=1/C22H10S.2Li/c23-22-16-6-2-4-13-7-8-15-11-14-5-1-3-12-9-10-17(22)21(18(12)14)20(15)19(13)16;;/h1-5,7-11H;;/rC22H10Li2S/c1-2-11-6-7-15-19-16(11)13(3-1)10-14-5-4-12-8-9-22-20(18(12)17(14)19)21(15)25(23-22)24-22/h1-10H
35 atoms
C  -1.68560331 -2.56284741 -0.61066443
C  -2.79135928 -1.762794 -0.43311695
C  -0.37719796 -1.98322018 -0.62174903
H  -3.78038447 -2.20727095 -0.42632185
C  -2.664891 -0.36991086 -0.25898987
C  -0.22071408 -0.59650223 -0.44916005
C  -1.36865504 0.21607108 -0.26638077
C  -3.78966707 0.46089145 -0.07680249
C  -1.23755346 1.62066222 -0.08912429
C  -3.64088969 1.81770439 0.09334229
C  -2.37128583 2.40042393 0.08838619
C  1.08787348 -0.0118668 -0.45804555
C  1.17494967 1.41172014 -0.27563707
C  0.08232679 2.18390905 -0.10164409
C  0.76686831 -2.79441198 -0.80650461
C  2.07774706 -2.23581624 -0.82147001
C  2.21944615 -0.80956851 -0.63820533
H  0.18854238 3.25392643 0.0323079
H  -2.26660704 3.47006841 0.22368557
H  -4.77702476 0.0152982 -0.07261669
H  -4.51415919 2.44194162 0.23241517
C  3.23563133 -3.04790615 -1.01221749
C  0.60699823 -4.19562972 -0.98136269
C  -1.80589269 -3.98432965 -0.78835751
C  -0.71542242 -4.75714956 -0.96361959
C  3.00275296 -4.4110539 -1.17960477
C  1.7313887 -4.98591593 -1.16582827
H  3.84646626 -5.07957443 -1.33029085
H  1.60986922 -6.05587091 -1.29992466
H  -0.82074581 -5.82766554 -1.09627018
H  -2.79597268 -4.4241354 -0.77838151
H  2.15654586 1.86509509 -0.28111747
S  3.82965196 -0.08809099 -0.64406543
Li 4.4458948 -1.783541 -2.24043275
Li 4.63000068 -2.14079956 0.32974316
energy: -1255.4390373513854
energyOcCorr: -1255.4400519910
s2: -0.00000000
charge: -0.000000
dipole: 70.391859 -66.250545 4.141314 -370.605507 368.676326 -1.929181 -173.352523 172.796396 -0.556127
quadrupole: 3617.657042 -3664.944556 -47.287515 3972.217542 -4062.736908 -90.519367 305.203974 -407.675796 -102.471822 -1040.022873 1014.978778 -25.044094 -426.991707 416.706878 -10.284828 861.317973 -856.458096 4.859877
temp: 298.15 k
press: 1.0 bar
thermalcorrgfe: 0.210565588632 hartree
thermalcorrener: 0.27101502168999997 hartree
entropy: 0.54065 kJ.mol-1.K-1
thermalcorrenthalpy: 0.27195960359399995 hartree
