title: ChemShell job
elementType: c
basis: def2-mSVP
elementType: h
elementType: s
elementType: li
method: uhf
method: dft
functional: pbeh-3c
elementType: c h s li
basis: def2-mSVP def2-mSVP def2-mSVP def2-mSVP
frequency: -9.07 -0.00 -0.00 0.0000 0.0000 0.0000 0.0000 31.76 43.10 44.65 46.91 53.08 64.65 71.82 83.27 90.86 102.69 113.09 118.10 125.39 132.61 144.84 153.21 159.47 169.06 170.74 173.78 181.46 190.29 197.15 203.75 213.99 246.79 267.28 283.29 298.21 303.25 310.61 322.35 334.54 345.23 356.30 367.29 378.85 394.65 396.69 401.91 403.40 414.45 415.71 426.62 436.14 450.43 471.15 481.79 494.63 504.04 505.96 517.59 526.23 534.30 537.01 566.63 569.55 592.60 600.43 602.83 622.00 669.94 676.65 684.86 734.23 741.40 774.74 779.10 786.87 800.44 822.36 825.51 832.59 858.77 861.20 873.05 878.45 895.91 929.23 966.14 988.63 1002.48 1008.43 1032.49 1062.14 1087.99 1127.98 1131.89 1177.75 1188.31 1196.29 1217.90 1231.42 1255.34 1277.88 1278.30 1309.83 1336.93 1340.53 1346.60 1384.84 1401.84 1415.23 1432.31 1461.25 1467.84 1484.39 1504.90 1518.31 1524.06 1564.45 1575.78 1602.35 1607.98 1641.76 1653.02 1686.35 1703.83 3231.83 3238.65 3245.66 3255.21 3255.38 3258.22 3264.49 3268.42 3273.20 3276.92
irintensity: 0.00000 0.00000 0.00000 0 0 0 0 11.00578 2.75652 59.46660 44.91315 59.29198 77.86540 127.36084 33.52840 32.63287 11.45453 9.54786 32.49486 15.50632 26.47008 71.88391 113.81303 14.02359 88.35926 170.71314 7.42577 18.31129 146.46265 8.16094 48.05006 41.76177 3.59636 4.55556 17.73899 316.08370 193.53232 37.32065 20.38002 152.33483 37.02029 4.50418 18.88319 37.76857 19.92277 88.66606 28.68989 152.50166 183.70729 63.02556 89.27441 38.54436 11.05278 228.52754 29.34490 106.45475 99.95750 155.69439 22.47098 158.24677 41.64319 18.47525 50.26955 0.40486 10.63219 3.14231 38.56625 13.73126 10.45537 6.03905 27.31712 14.22632 0.15827 36.64135 61.23090 4.26021 62.83486 4.14085 7.99973 7.97281 12.29872 42.91239 258.51792 21.43771 18.53533 57.22627 4.18571 2.11695 2.37793 4.43002 0.07508 49.24292 12.51953 1.69820 32.17625 23.13089 28.21316 82.20167 33.68909 49.61702 57.58318 259.94770 16.90933 174.27347 160.29625 121.34882 437.88404 131.60405 48.72364 212.81001 343.16147 11.21693 14.78633 558.79262 43.45041 2.11411 7.45527 73.07417 25.22671 4.66707 129.60365 136.67225 462.48457 302.70170 349.73212 19.29096 16.55200 18.23365 32.57071 16.16131 53.67244 24.87113 18.45085 23.83178 42.31497
energy: -2501.700933082 hartree
zeropoint: 0.26638733212 hartree
formula: C22H10Li9S4
InChI: InChI=1/C22H10S.9Li.3S/c23-18-9-8-13-5-6-15-10-14-3-1-2-12-4-7-16-11-17(18)20(13)22(15)21(16)19(12)14;;;;;;;;;;;;/h1-10H;;;;;;;;;;;;/rC22H10Li3S.Li6S3/c23-26(24)16-9-7-12-4-5-14-10-13-3-1-2-11-6-8-15-20(17(11)13)19(14)18(12)21(16)22(15)25-26;1-8-3-7-4-9(2,5-8)6(7)8/h1-10H;
45 atoms
C  -2.12254506 -2.90375767 -1.71285241
C  -3.25817873 -2.10096776 -1.51883183
C  -0.8502963 -2.45357002 -1.24961846
H  -4.21492532 -2.43727002 -1.90678179
C  -3.17497144 -0.84657231 -0.893808
C  -0.74748981 -1.20511106 -0.58127553
C  -1.90421268 -0.39051196 -0.41273825
C  -4.31034691 -0.03064499 -0.66637142
C  -1.8080026 0.8486075 0.27038747
C  -4.19470162 1.18456226 -0.0052851
C  -2.96802366 1.63212961 0.47281025
C  0.51672654 -0.80370181 -0.05831989
C  0.55670673 0.45418885 0.62224573
C  -0.53547454 1.24507766 0.77633491
C  0.31162486 -3.24879783 -1.42561894
C  1.57077022 -2.78969549 -0.8907809
C  1.69522771 -1.57334852 -0.18024608
H  -0.45831605 2.19136105 1.29948935
H  -2.89008247 2.58226921 0.98670389
H  -5.2794602 -0.36780446 -1.01341659
H  -5.08011943 1.788274 0.15339148
C  2.70897409 -3.66046009 -1.07734298
C  0.19598778 -4.51243419 -2.07646136
C  -2.19745875 -4.17373123 -2.33896744
C  -1.08111288 -4.94655964 -2.51406481
C  2.57440691 -4.87689274 -1.7441509
C  1.34782275 -5.3178475 -2.22354205
H  3.44437171 -5.51015618 -1.87294439
H  1.27186375 -6.28083949 -2.71269989
H  -1.16292197 -5.91156593 -3.00215486
H  -3.16123934 -4.52988768 -2.6816138
S  4.30961831 -3.18188734 -0.47016705
S  -2.87821098 -2.27484244 2.6218442
H  1.51177933 0.77624961 1.02289099
S  -0.39340455 -5.12803802 1.74052051
S  -4.15972833 -5.45597958 0.76884811
Li -2.00017167 -5.55760577 0.05102509
Li -2.685591 -4.68354017 2.45793252
Li 5.22513411 -4.97203194 0.76277251
Li -0.82005551 -2.82643788 1.69801231
Li -3.40296242 -0.20531488 1.92264808
Li 1.17872517 -5.03778143 0.16132648
Li -3.91484546 -3.18104284 0.70234602
Li 3.5739215 -1.17101487 0.54026274
Li 5.39441449 -2.6402709 -2.49290032
energy: -2501.7009330822848
energyOcCorr: -2501.7091936005
s2: 0.79897635
charge: -0.000000
dipole: -310.611299 332.851075 22.239775 -1148.947674 1152.378694 3.431020 -64.838636 59.416882 -5.421755
quadrupole: 6367.654764 -6413.571597 -45.916833 9777.979009 -9968.485586 -190.506577 1768.822179 -1931.470910 -162.648730 489.896945 -674.841644 -184.944699 -784.471494 784.259908 -0.211585 728.848692 -674.248092 54.600600
temp: 298.15 k
press: 1.0 bar
thermalcorrgfe: 0.203820207374 hartree
thermalcorrener: 0.299261067658 hartree
entropy: 0.84876 kJ.mol-1.K-1
thermalcorrenthalpy: 0.300205649562 hartree
