title: ChemShell job
elementType: c
basis: def2-TZVPD
elementType: h
elementType: li
method: uhf
method: dft
functional: cam-b3lyp
elementType: c h li
basis: def2-TZVPD def2-TZVPD def2-TZVPD
energy: -851.6857271077 hartree
formula: C22H10Li
InChI: InChI=1/C22H10.Li/c1-3-13-7-9-18-12-16-6-2-4-14-8-10-17-11-15(5-1)19(13)21(18)22(17)20(14)16;/h1-5,7-11H;/rC22H10Li/c23-18-9-8-13-5-6-15-10-14-3-1-2-12-4-7-16-11-17(18)20(13)22(15)21(16)19(12)14/h1-10H
33 atoms
C  -1.71197281 -2.56640771 -0.64762593
C  -2.82548768 -1.7788758 -0.45054595
C  -0.40744495 -1.97395478 -0.62885793
H  -3.80994857 -2.23307075 -0.46148095
C  -2.71822069 -0.38852195 -0.23533098
C  -0.28377097 -0.58749093 -0.41717695
C  -1.43067784 0.21249298 -0.22318997
C  -3.84773456 0.42976995 -0.031383
C  -1.30010085 1.61333782 -0.012745
C  -3.70619258 1.7834088 0.17319598
C  -2.44119372 2.37814173 0.18228798
C  1.02047689 0.01703 -0.39511295
C  1.12249887 1.43477784 -0.18747698
C  0.018465 2.19027475 -0.00745
C  0.74311092 -2.77874169 -0.81764991
C  2.05940677 -2.21039875 -0.78446791
C  2.07168176 -0.8295509 -0.57347094
H  0.11061299 3.25819863 0.14876198
H  -2.34838173 3.44513961 0.34363496
H  -4.83305345 -0.02031 -0.03747
H  -4.58396448 2.39724973 0.32860096
C  3.25300863 -2.97368666 -0.94817089
C  0.60598893 -4.17187352 -1.03824288
C  -1.81321379 -3.98275755 -0.8740879
C  -0.71256292 -4.74137846 -1.06297188
C  3.02472866 -4.33554851 -1.16316487
C  1.7577008 -4.92753244 -1.21363686
H  3.87387056 -5.00050543 -1.30174085
H  1.66409681 -5.99509932 -1.38621084
H  -0.81009991 -5.80723634 -1.23371386
H  -2.79866468 -4.4323225 -0.8912559
H  2.10590876 1.88670279 -0.17714198
Li 5.12773642 -2.12276676 -0.81964191
energy: -851.6857271076935
energyOcCorr: -851.6873786795
s2: 0.79284923
charge: -0.000000
dipole: -77.810357 81.380113 3.569756 -355.258200 355.710268 0.452068 -142.240869 142.295156 0.054286
quadrupole: 2660.223222 -2698.300067 -38.076844 3879.619382 -3970.356913 -90.737531 241.462025 -343.354039 -101.892015 -933.604722 924.919308 -8.685413 -238.856529 233.521434 -5.335096 885.025823 -883.677178 1.348645
