title: ChemShell job
elementType: c
basis: def2-mSVP
elementType: h
elementType: s
elementType: li
method: uhf
method: dft
functional: pbeh-3c
elementType: c h s li
basis: def2-mSVP def2-mSVP def2-mSVP def2-mSVP
frequency: -0.00 -0.00 -0.00 0.0000 0.0000 0.0000 30.87 38.01 47.49 50.13 56.07 58.48 61.27 74.50 83.01 106.20 116.68 126.51 139.70 141.74 156.13 163.77 169.28 171.54 174.47 180.66 183.60 191.82 209.83 216.91 224.16 233.56 262.63 263.96 280.75 291.83 298.57 310.65 324.10 328.97 350.05 358.99 370.27 382.20 388.07 393.06 401.01 402.89 413.95 416.74 429.39 432.13 439.64 452.42 482.06 484.16 496.73 510.65 515.52 520.93 531.37 537.47 566.69 568.72 582.64 593.00 609.91 619.87 668.29 670.26 681.49 714.65 725.70 734.62 750.40 758.04 773.73 780.56 813.96 819.55 826.10 843.68 857.11 860.42 876.35 923.58 945.74 971.09 994.03 1001.84 1021.78 1044.42 1079.02 1120.89 1133.55 1164.07 1178.42 1187.02 1207.57 1223.18 1252.26 1258.98 1262.01 1291.85 1322.00 1330.69 1342.34 1365.62 1398.17 1401.87 1412.57 1439.38 1461.54 1492.57 1502.55 1506.08 1522.37 1556.75 1576.32 1588.76 1608.88 1634.88 1640.84 1679.63 1705.69 3216.45 3226.97 3231.12 3231.85 3241.87 3248.80 3254.61 3256.51 3266.35 3273.48
irintensity: 0.00000 0.00000 0.00000 0 0 0 44.12801 10.59529 135.36259 21.63495 19.97412 113.15551 46.42537 61.64516 41.20624 8.30886 3.11213 6.80099 77.14387 21.42044 10.46950 0.95187 30.66558 51.14015 78.03572 67.60948 43.78386 47.78513 64.08062 16.24120 70.76587 137.28921 18.39583 7.17692 17.93031 8.37992 241.50402 254.13609 55.44490 120.69041 62.47024 15.00119 36.79103 19.22308 0.71394 1.99998 38.63411 74.11565 50.20266 206.91720 231.99701 9.98428 70.57832 229.74815 5.99785 16.35593 270.41439 92.11003 23.15273 165.92086 117.84304 52.33830 110.76070 2.45941 17.84131 53.35842 24.11383 22.84797 0.09762 17.88128 35.11947 86.94325 26.26375 12.23031 98.34538 43.75855 44.49958 3.46730 52.16608 18.05226 21.06866 145.55026 40.07530 79.72539 22.11107 108.83639 6.04941 10.06446 2.19339 0.68983 0.50510 9.27063 38.27303 69.77219 25.24943 10.90608 294.00660 54.63097 8.80381 295.04583 36.91240 162.49378 69.57464 412.72191 86.88497 421.74967 603.92840 49.04483 459.31317 413.19183 382.59158 15.57067 383.85550 15.09482 485.58804 905.26929 85.14563 285.63762 82.23327 290.07180 124.72593 430.23395 1057.90608 387.80740 31.76378 46.19642 35.80243 84.31713 22.83259 34.86870 93.41949 41.56315 42.46979 31.22901 33.40107
energy: -2501.787763111 hartree
zeropoint: 0.2650923408 hartree
formula: C22H10Li9S4
InChI: InChI=1/C22H10S.9Li.3S/c23-18-9-8-13-5-6-15-10-14-3-1-2-12-4-7-16-11-17(18)20(13)22(15)21(16)19(12)14;;;;;;;;;;;;/h1-10H;;;;;;;;;;;;/rC22H10Li9S4/c23-33(24)22-18-17-12-3-1-9-7-8-2-6-13(10-4-5-11(19(18)26-33)16(14(8)10)15(9)17)25-34-27-32-28-35(29-34,30(32)34)31(22)20(12)21(22)31/h1-7,13,20-21H
45 atoms
C  -2.12910815 -2.92046038 -1.69783006
C  -3.28427501 -2.10843247 -1.47257468
C  -0.85795145 -2.46744599 -1.24008706
H  -4.23739092 -2.4425961 -1.87369555
C  -3.20266822 -0.85939117 -0.86298111
C  -0.75903419 -1.21029463 -0.56608334
C  -1.9204278 -0.38915245 -0.39272815
C  -4.33521639 -0.03210552 -0.60647128
C  -1.81970053 0.85156143 0.27585012
C  -4.20498805 1.20114556 0.03333964
C  -2.98511081 1.6551001 0.49971105
C  0.50566367 -0.80699714 -0.05680283
C  0.54554432 0.45001558 0.61558537
C  -0.54990444 1.24252897 0.77163317
C  0.31184171 -3.25869204 -1.41751173
C  1.57801905 -2.78790994 -0.87828117
C  1.6955932 -1.57621423 -0.18304508
H  -0.46636464 2.19070761 1.29141679
H  -2.89216963 2.60758217 1.00563278
H  -5.31267553 -0.36956768 -0.9305447
H  -5.09469518 1.79873889 0.19985397
C  2.71701259 -3.68125238 -1.05296567
C  0.19739478 -4.5307396 -2.06488201
C  -2.19737419 -4.16838461 -2.32741071
C  -1.06715434 -4.95376744 -2.50328276
C  2.58137901 -4.89539666 -1.71815527
C  1.35942197 -5.36016998 -2.18214578
H  3.45457251 -5.53007065 -1.83339686
H  1.28369734 -6.32333778 -2.67061113
H  -1.15575054 -5.91658115 -2.99605025
H  -3.15822303 -4.53048387 -2.67481824
S  4.32831252 -3.18465626 -0.45812438
S  -2.86973024 -2.27065451 2.61548807
H  1.5024145 0.77705817 1.00974682
S  -0.37800363 -5.11765797 1.71511239
S  -4.1447495 -5.43921722 0.76821221
Li -1.98772939 -5.4352623 -0.02562258
Li -2.65767802 -4.66278285 2.43335836
Li 5.17743789 -4.98480603 0.78017723
Li -0.82330909 -2.80287079 1.59709345
Li -3.36258375 -0.27843012 1.67318077
Li 1.17466391 -5.01133724 0.08058974
Li -3.85103933 -3.15736808 0.62637506
Li 3.56617225 -1.18385257 0.51201062
Li 5.31277461 -2.6456953 -2.50991344
energy: -2501.7877631108695
energyOcCorr: -2501.8011032455
s2: -0.00000000
charge: -1.000000
dipole: -310.639826 333.721481 23.081655 -1149.066327 1157.043919 7.977592 -64.028523 59.037971 -4.990553
quadrupole: 6364.948473 -6451.799554 -86.851081 9774.736232 -10012.724382 -237.988150 1724.716347 -1901.828767 -177.112420 459.724477 -637.199962 -177.475485 -777.209750 781.344522 4.134773 741.643167 -696.663728 44.979439
temp: 298.15 k
press: 1.0 bar
thermalcorrgfe: 0.20222812981000002 hartree
thermalcorrener: 0.298503116856 hartree
entropy: 0.85609 kJ.mol-1.K-1
thermalcorrenthalpy: 0.29944769876 hartree
