program: Gaussian 09
title: 000076722
version: EM64L-G09RevD.01
frameworkgroup: C1[X(C15H26O2)]
method: RPBEPBE
basis: SDD
operation: Freq
keyword: #pfreq=noraman
keyword: PBEPBE/SDD
title: #p freq=noraman PBEPBE/SDD
converged: YES YES NO NO
title: Mulliken charges:
elementType: O O C C C C C C C C C C C C C C C H H H H H H H H H H H H H H H H H H H H H H H H H H
charge: -0.281630 -0.265166 -0.412516 -0.472491 0.041012 0.474890 -0.571007 -0.353793 -0.465628 -0.712116 -0.845284 -0.261322 0.357898 0.296805 -0.796080 -0.807731 -0.756231 0.207021 0.203680 0.203865 0.221511 0.282735 0.216261 0.196890 0.222151 0.204162 0.211281 0.219363 0.240097 0.211922 0.221183 0.232519 0.230073 0.221375 0.224158 0.213747 0.222721 0.275214 0.211495 0.201412 0.243682 0.246788 0.245084
chargesum: 0.00000
title: Mulliken charges with hydrogens summed into heavy atoms:
elementType: O O C C C C C C C C C C C C C C C
charge: -0.281630 -0.265166 -0.001815 -0.047115 0.323747 0.474890 -0.157856 -0.131641 -0.050185 -0.040734 -0.161508 -0.039947 0.357898 0.296805 -0.135455 -0.119610 -0.020677
polarizability: 1.85165880e+02 -1.86757222e+00 1.66723697e+02 -4.25219149e+00 6.23542041e+00 1.53535616e+02
1716.lowfreq: -27.4968 -13.7677 -6.8985 -1.6019 0.0004 0.0006 0.0007 18.3226 24.5616
frequency: -27.4095 15.9065 24.2150 37.5108 45.1053 47.9521 60.6931 79.4493 89.3001 118.4596 131.2711 154.5964 163.0449 179.4208 188.3473 199.9857 213.1852 236.4915 265.1246 282.9986 301.6534 346.4991 381.9494 387.1042 397.3490 414.7612 440.3545 451.7130 472.9104 498.5435 541.3900 570.2712 584.2866 598.8002 718.4432 754.2716 787.1393 805.2891 828.8512 851.4278 858.9645 898.2172 905.1564 922.1816 951.7621 959.8462 979.5123 994.2120 995.1313 997.2672 1010.0995 1029.1839 1037.6209 1040.3092 1058.5340 1082.8359 1095.7474 1109.3627 1120.5317 1146.9621 1157.5867 1176.9312 1197.4901 1212.1274 1228.9763 1232.9656 1239.2786 1303.9013 1304.2366 1317.9344 1329.1922 1343.2577 1354.0977 1365.0518 1371.0107 1380.9481 1382.2739 1389.7477 1392.2185 1403.1265 1447.0840 1452.7451 1452.8152 1454.5671 1460.1463 1462.2294 1463.8826 1465.1833 1467.4804 1473.0290 1473.7459 1477.1855 1482.7352 1483.1384 1635.2272 1683.4354 1692.0701 2948.0081 2950.5411 2959.3363 2962.3033 2965.7347 2977.4035 2986.2049 2990.7188 3006.7774 3013.1041 3017.2111 3026.7513 3029.4884 3033.3755 3034.0538 3043.9711 3055.3279 3074.2610 3080.3229 3083.9620 3084.7659 3086.3016 3086.6675 3095.2157 3096.3645 3142.1711
redmass: 1.0593 3.2650 3.6897 5.6279 4.5108 3.2950 3.5204 3.2811 3.0084 1.0804 2.1296 1.5660 2.5265 1.7613 2.3033 1.4481 1.3193 1.9700 2.1857 2.5857 2.3413 2.6849 2.7704 2.2871 2.5834 2.6540 2.5398 2.3140 2.7082 2.6026 2.2432 3.1207 3.3223 3.5115 2.1188 2.7902 2.0660 1.6956 1.9085 1.8826 1.8530 2.1380 3.2821 1.8331 1.3839 1.7345 1.6879 1.5700 1.3073 1.8100 2.5062 1.8067 1.6430 1.6636 1.8175 1.6652 2.5463 1.7797 2.0703 1.9315 1.5695 1.4176 1.2398 3.0849 2.0074 1.6785 1.4519 1.2551 1.3825 1.3223 1.4319 1.2315 1.4462 1.4774 1.4976 1.2362 1.2404 1.2915 1.3260 1.2109 1.0869 1.0690 1.0751 1.0483 1.0703 1.0700 1.0644 1.0796 1.0584 1.0611 1.0527 1.0697 1.0559 1.0703 8.8160 6.8975 6.5634 1.0635 1.0384 1.0386 1.0416 1.0585 1.0591 1.0390 1.0596 1.0367 1.0959 1.0961 1.0964 1.0953 1.0963 1.0976 1.0914 1.0979 1.0902 1.0961 1.0978 1.0961 1.0955 1.0943 1.0972 1.1006 1.1010
irintensity: 1.0060 0.0960 0.1232 0.9520 0.6174 0.2016 0.0896 0.9558 1.5695 0.6133 3.0522 0.3483 0.7592 5.0670 1.9826 0.1416 1.1481 0.2272 0.5913 1.1539 0.1710 3.3254 1.3665 4.8271 4.1950 4.5930 1.9029 4.4771 1.0374 0.3138 13.1034 3.9916 4.5897 2.6688 6.5137 5.6681 9.6374 9.3639 6.1225 16.3539 11.1585 12.9444 35.3268 5.7183 1.1427 6.4498 4.6376 5.7270 2.5265 67.7957 8.7175 19.5866 1.1182 9.1791 18.4302 5.0313 15.1763 12.6677 9.4621 50.5020 5.5103 7.7341 5.8091 263.9220 1.4754 4.3658 11.0125 0.8875 0.1332 0.1580 0.7351 4.9831 0.7636 1.3977 6.9849 47.3958 29.9852 14.3096 33.0264 11.3296 4.6798 35.1176 9.7213 16.8257 2.0599 2.6844 2.9707 11.7863 9.0742 27.6870 23.0069 21.5425 19.0528 5.4672 177.5798 5.1216 4.9620 16.8737 35.9743 66.4610 25.9355 91.2008 17.0247 26.9108 55.5993 3.7697 7.8304 29.8500 40.7124 11.1855 37.3111 38.8371 1.4924 31.4852 6.5540 22.9659 42.1788 25.2980 24.1655 43.3761 8.7619 24.2118 10.5733
temp: 298.150 k
press: 1.00000 atm
elementType: 8 8 6 6 6 6 6 6 6 6 6 6 6 6 6 6 6 1 1 1 1 1 1 1 1 1 1 1 1 1 1 1 1 1 1 1 1 1 1 1 1 1 1
symmnumber: 1
zpe: 982725.7 jmol-1
zpe.correction: 0.374300 hartree
zpe.thermalcorrener: 0.395437 hartree
zpe.thermalcorrenthalpy: 0.396382 hartree
zpe.thermalcorrgfe: 0.321929 hartree
zpe.sumelectzpe: -736.259391 hartree
zpe.sumelectthermal: -736.238254 hartree
zpe.sumelectthermalent: -736.237310 hartree
zpe.sumelectthermalfe: -736.311763 hartree
dipole: 0.3564 -1.1771 1.3322
dipole: 1.8131
quadrupole: -96.1461 -109.8117 -102.8482
quadrupole: 0.2203 -2.7901 2.3193
quadrupole: 6.7892 -6.8763 0.0871 0.2203 -2.7901 2.3193
hfenergy: -736.6336914 hartree
pointgroup: C01[X(C15H26O2)]
dipole: -0.1297162 -0.4112553 -0.5682089 debye
polarizability: 185.4514393|2.1166277|167.6776473|-3.1524569|-4.8118883|152.2961067 unknown
InChI: InChI=1S/C15H26O2/c1-12(2)8-6-9-13(3)10-7-11-14(4)17-15(5)16/h8,10,14H,6-7,9,11H2,1-5H3
charge 0 multiplicity 1
43 atoms
O  -2.710926 -0.045865 -0.376401
O  -1.970658 1.572621 1.139121
C  -1.16475 -1.236615 -1.83953
C  -0.962001 -2.386754 -0.808655
C  -1.46039 0.130264 -1.208572
C  1.393583 -2.058549 0.203427
C  2.249663 -1.619677 1.385525
C  0.031807 -2.052829 0.293589
C  2.998676 -0.269661 1.150645
C  -1.718461 1.243816 -2.231306
C  2.149282 -2.451449 -1.053987
C  2.046303 0.889578 0.91793
C  2.22682 1.979964 0.117246
C  -2.837102 0.74669 0.763073
C  3.470785 2.233117 -0.718374
C  1.158681 3.05978 0.021236
C  -4.154118 0.466384 1.458031
H  -1.980782 -1.505953 -2.539108
H  -0.242086 -1.116725 -2.441355
H  -0.644939 -3.29133 -1.364571
H  -1.940858 -2.620817 -0.352953
H  -0.648273 0.420978 -0.518685
H  1.612147 -1.515238 2.285012
H  3.006326 -2.399788 1.612811
H  -0.406869 -1.732318 1.250761
H  3.708983 -0.379187 0.309053
H  3.620533 -0.071762 2.050348
H  -2.579377 0.993073 -2.876637
H  -1.918249 2.203072 -1.723921
H  -0.828675 1.376215 -2.874056
H  2.97016 -3.155428 -0.814332
H  2.617651 -1.565857 -1.528222
H  1.499045 -2.926659 -1.807863
H  1.104006 0.834925 1.486444
H  4.202353 1.409477 -0.668324
H  3.203773 2.394814 -1.782036
H  3.982566 3.156846 -0.380692
H  0.252637 2.796031 0.59319
H  1.540739 4.030952 0.396391
H  0.861999 3.228856 -1.034553
H  -4.201387 1.025995 2.403218
H  -4.993635 0.769209 0.807656
H  -4.263479 -0.614194 1.652128
