program: Gaussian 16
title: prereaction
version: ES64L-G16RevC.02
method: UwB97XD
basis: def2SVP
operation: Freq
keyword: #P
keyword: Geom=AllCheck
keyword: Guess=TCheck
keyword: SCRF=Check
keyword: GenChk
keyword: UwB97XD/def2SVPFreq
converged: YES YES NO YES
polarizability: 3.94248425e+02 7.25057097e+01 3.65338243e+02 2.19007498e+01 2.31011539e+01 4.36263249e+02
1716.lowfreq: -7.4515 -0.0014 -0.0012 -0.0008 7.1762 12.8521 21.4160 29.8109 35.0210
frequency: 20.4447 28.9413 34.7196 37.8070 42.4206 52.3507 61.6597 64.1416 74.0617 86.0839 93.2216 106.7743 113.1430 134.9621 164.4021 171.3966 183.5360 194.3295 228.8008 256.0390 271.2132 282.2199 295.2278 315.4795 333.0926 362.1045 377.6796 411.1476 413.3960 415.8153 420.8008 425.0649 447.2327 481.8770 489.5568 513.3944 517.1856 523.9633 534.5785 627.1264 628.9214 629.2993 631.8264 705.4417 711.3872 718.9530 720.6279 725.5273 726.7865 740.3053 756.4891 771.9821 782.5528 783.3051 784.2350 878.3863 880.9192 885.0119 887.3232 925.7076 967.3881 973.0177 984.4276 986.4694 1000.0884 1010.4073 1014.8073 1015.8996 1018.6252 1023.1515 1025.3830 1029.5113 1031.4122 1036.3718 1046.8663 1051.4738 1055.8494 1055.9532 1057.5292 1058.8439 1061.1079 1061.5437 1063.6871 1103.6334 1106.9475 1115.6003 1118.7975 1124.9443 1133.0238 1147.0576 1163.0918 1165.8791 1168.1676 1171.4696 1172.3336 1175.2505 1192.2158 1202.0924 1203.3024 1211.6294 1231.8830 1325.6263 1332.5804 1334.0594 1340.7507 1366.6024 1368.9380 1374.6802 1376.4550 1475.5571 1478.3552 1478.7303 1482.5636 1518.8177 1521.6558 1527.3441 1531.8847 1657.6000 1659.9168 1663.8248 1666.6259 1671.0171 1674.5166 1681.1374 1682.9098 2358.7467 3206.2054 3212.1739 3213.7155 3213.8268 3215.4846 3216.8752 3218.9063 3221.0298 3221.7239 3223.6366 3223.8928 3227.4798 3230.2350 3231.9138 3232.6133 3234.1926 3235.3093 3237.8041 3238.3614 3248.8677 3767.5094
redmass: 5.9689 5.0785 5.4116 6.3170 4.2634 5.5024 4.3790 4.9011 4.2829 3.7356 2.6915 3.0257 5.1058 4.3520 4.6835 3.8649 5.3857 4.3479 5.4628 5.1944 4.4480 4.5567 6.0069 7.2897 6.3081 5.8207 7.5827 3.1536 2.8324 2.9660 4.5180 3.1041 4.9545 4.1618 9.7001 5.1438 4.1702 4.1837 6.4687 6.3989 6.3982 6.4059 6.3725 6.4249 6.0805 1.7527 1.7561 1.8365 1.8191 6.5166 6.3546 1.6947 1.7074 1.7694 1.6980 1.2540 1.2491 1.2417 1.2477 4.1829 1.3552 1.3633 1.3473 1.3471 1.2496 1.9290 4.2119 5.3694 3.3343 2.4741 1.8043 1.3871 1.3886 1.4408 6.5028 1.3984 1.3750 2.2870 1.4788 2.4720 1.8261 1.5455 2.1745 1.9676 2.0261 1.5868 1.6455 1.5322 3.1155 3.9146 3.6168 3.4364 1.0952 1.0849 1.0864 1.0832 1.1309 1.1402 1.1405 1.1271 1.0856 1.4739 1.5778 1.5258 1.6340 4.6619 3.7116 3.1371 4.3305 2.3656 2.3807 2.3823 2.4146 2.2523 2.1649 2.2474 2.2096 5.9559 6.1607 5.9543 6.0445 5.9467 6.1210 6.0699 5.9753 1.1030 1.0909 1.0875 1.0891 1.0898 1.0880 1.0913 1.0900 1.0909 1.0940 1.0938 1.0940 1.0948 1.0977 1.0983 1.0974 1.0996 1.1017 1.1014 1.1014 1.0935 1.0659
irintensity: 0.2382 1.3470 0.1041 0.6567 1.0462 0.2657 3.4665 0.3402 11.2073 19.5033 54.8569 36.2089 11.0471 19.2951 17.6147 14.9082 15.7959 1.2683 29.2710 11.4120 9.7253 4.9857 8.3836 15.2354 102.2771 5.5032 8.4324 16.4386 0.5493 7.6857 28.8961 8.1218 103.7165 5.6078 202.8427 97.7472 48.0171 78.6136 229.8805 0.2688 0.3561 0.3266 0.1548 3.6349 5.0022 58.8434 114.7677 54.9234 38.7083 32.4941 110.2071 22.4592 49.3617 39.7398 31.2280 1.4535 0.0967 0.4933 1.9354 505.0525 0.6472 1.7744 3.9765 1.6622 457.0543 108.0677 4.8462 4.3869 4.5634 6.3137 0.8072 0.2596 5.2180 2.7883 371.0508 4.0494 0.6447 17.0844 0.4996 0.3651 7.8383 0.2814 31.1560 67.3239 23.3215 11.4960 1.7127 11.1730 184.5255 192.0787 157.9120 340.3984 8.3389 0.4741 5.1028 0.9812 2.0045 1.3941 4.4975 1.7821 143.1471 2.9467 3.7179 2.9849 3.7647 5.1033 4.9977 8.5302 6.6508 21.5205 86.4518 19.4558 40.6027 2.4165 2.7884 0.6318 0.6940 1.2820 0.7394 7.1989 1.5571 20.8401 10.4860 18.3037 37.5462 6629.2628 0.1031 0.1923 0.4119 0.9197 0.1122 0.5718 2.0935 0.4273 0.5323 1.7658 0.4270 4.1907 4.3405 8.1022 3.2064 4.3901 10.7565 5.5823 3.8644 3.7256 439.7356
temp: 298.150 k
press: 1.00000 atm
elementType: 6 6 6 6 1 6 1 6 1 1 1 6 6 6 6 1 6 1 6 1 1 1 15 15 8 6 6 6 6 1 6 1 6 1 1 1 6 6 6 6 1 6 1 6 1 1 1 8 8 1 1
symmnumber: 1
zpe: 1060143.6 jmol-1
zpe.correction: 0.403787 hartree
zpe.thermalcorrener: 0.430289 hartree
zpe.thermalcorrenthalpy: 0.431233 hartree
zpe.thermalcorrgfe: 0.343542 hartree
zpe.sumelectzpe: -1834.269589 hartree
zpe.sumelectthermal: -1834.243087 hartree
zpe.sumelectthermalent: -1834.242143 hartree
zpe.sumelectthermalfe: -1834.329834 hartree
dipole: 1.8039 1.9289 7.9938
dipole: 8.4187
quadrupole: -147.3373 -150.5684 -94.4211
quadrupole: 10.8853 1.8667 18.3887
quadrupole: -16.5617 -19.7929 36.3545 10.8853 1.8667 18.3887
hfenergy: -1834.6733764 hartree
pointgroup: C01 [X(C24H22O3P2)]
dipole: -0.6669316 -0.3270482 0.8994242 debye
polarizability: 394.2484247|72.5057097|365.3382433|21.9007498|23.1011539|436.263249 unknown
InChI: InChI=1/C12H12O2P.C12H10OP/c13-15(14,11-7-3-1-4-8-11)12-9-5-2-6-10-12;13-14(11-7-3-1-4-8-11)12-9-5-2-6-10-12/h1-10,13-14H;1-10H
charge 1 multiplicity 2
51 atoms
C  2.92350263 0.98880785 -1.8929186
C  2.90135626 0.17261048 -3.03424329
C  4.06108179 1.75336836 -1.59279425
C  4.02120998 0.11384859 -3.85909379
H  2.02018621 -0.42657466 -3.27510731
C  5.17623595 1.68384547 -2.42331421
H  4.07314705 2.38890038 -0.70465178
C  5.15679267 0.86725604 -3.55528845
H  4.00848042 -0.52754736 -4.74275741
H  6.06626098 2.26972902 -2.18410492
H  6.03289112 0.81734901 -4.20574685
C  0.55069238 -0.39734596 -0.74915371
C  0.66770684 -1.20445293 0.39092436
C  -0.32442962 -0.75452676 -1.78279002
C  -0.07852845 -2.37534208 0.48537882
H  1.35145329 -0.91745588 1.19197008
C  -1.06094373 -1.93330819 -1.68323104
H  -0.43800512 -0.11202411 -2.65973912
C  -0.94038208 -2.73962031 -0.55105953
H  0.01285611 -3.00713554 1.37149098
H  -1.74103195 -2.21681017 -2.48910079
H  -1.5266264 -3.65792934 -0.47316866
P  1.48919328 1.14263464 -0.81620168
P  -0.29640732 2.15221115 3.28986358
O  1.88764426 1.66444267 0.56855269
C  0.80609902 1.40588775 4.48519174
C  1.16661097 2.11342571 5.64040875
C  1.36159131 0.14463668 4.2275712
C  2.0841207 1.5585651 6.5285134
H  0.73688696 3.09377602 5.8579043
C  2.27674 -0.40223752 5.12227291
H  1.07421374 -0.41762099 3.33654589
C  2.63815239 0.30457227 6.26960114
H  2.36406789 2.10782715 7.4294552
H  2.70661036 -1.38586213 4.9238392
H  3.35537887 -0.12742895 6.97093449
C  -1.42576274 0.96884396 2.58882924
C  -1.82159845 1.13978096 1.25511286
C  -1.94766781 -0.07946858 3.35954558
C  -2.74463619 0.26150765 0.69609197
H  -1.40809159 1.95401751 0.65546287
C  -2.86565268 -0.95527582 2.78808696
H  -1.63915815 -0.21428532 4.39896918
C  -3.26238021 -0.78376149 1.46059752
H  -3.05342867 0.38870455 -0.34294873
H  -3.27369712 -1.77551821 3.38157328
H  -3.98109543 -1.47586193 1.01636522
O  0.4800246 2.92144249 2.17306589
O  -1.19615778 3.24712667 4.01963367
H  -0.74192016 4.0857087 4.21453807
H  1.08357064 2.38351142 1.51420809
