program: Gaussian 16
title: prereaction
version: ES64L-G16RevC.02
method: UwB97XD
basis: def2SVP
operation: Freq
keyword: #P
keyword: Geom=AllCheck
keyword: Guess=TCheck
keyword: SCRF=Check
keyword: GenChk
keyword: UwB97XD/def2SVP
keyword: Freq
converged: YES YES NO YES
polarizability: 7.18036005e+02 1.46592102e+00 6.43412818e+02 1.68847064e+01 2.30215891e+01 4.99154883e+02
1716.lowfreq: -12.2228 -0.0013 0.0003 0.0011 8.2313 10.7692 14.7481 21.8803 22.8663
frequency: 10.7961 21.7546 22.3870 25.4022 33.9572 38.1348 41.4174 44.1196 47.2285 51.4950 55.1223 61.5778 66.7550 70.5100 77.9773 81.1374 84.1146 100.3291 127.1359 133.7347 155.3637 183.3218 187.1419 190.5983 200.7857 225.8109 237.1538 251.8704 266.0824 273.0495 285.3522 294.8366 306.7729 308.6991 324.6880 387.8977 394.4684 407.0120 412.2841 414.9853 415.9199 417.6619 420.3282 427.1921 441.0459 443.8757 472.6260 483.7548 493.7709 498.0502 520.2392 535.8122 548.4348 581.1166 626.6415 628.3355 630.0702 630.4902 631.3391 631.9378 656.9996 688.6555 707.1179 711.2992 713.7131 716.7193 722.1564 723.4502 725.1684 727.4062 730.6877 736.3438 745.4576 750.4064 777.5791 782.1306 782.5259 786.7903 794.7778 833.9259 879.9680 881.0667 883.5768 884.5760 885.3502 886.8353 887.9827 892.2566 963.7207 973.6215 975.7386 976.2593 981.8716 985.1082 994.5724 1014.9235 1016.1831 1018.3960 1018.5483 1019.0765 1020.6628 1029.4921 1030.5413 1031.0133 1031.9587 1032.3341 1033.9546 1052.1043 1053.3825 1054.1356 1057.0795 1057.5993 1057.8543 1058.0406 1058.1588 1059.1723 1059.3192 1059.3653 1062.0711 1108.1573 1108.9553 1109.6430 1113.5487 1117.6988 1118.3305 1121.4766 1127.2363 1133.5069 1140.0995 1163.7124 1167.9424 1170.5106 1171.2853 1172.0137 1172.2237 1173.9922 1189.7992 1193.5955 1197.0593 1198.3081 1199.5434 1202.9556 1207.0101 1215.8643 1325.8346 1328.0031 1328.2221 1333.7265 1334.3347 1336.0730 1360.3804 1366.2403 1369.2595 1371.1916 1372.5012 1373.1393 1380.8528 1475.1470 1477.9464 1478.6210 1481.4036 1484.1289 1487.8266 1520.1818 1522.3148 1526.6953 1530.7567 1532.7864 1538.2544 1605.9187 1654.8655 1662.2944 1663.0736 1664.7382 1666.7933 1667.1748 1668.8560 1675.7515 1683.6636 1684.9862 1686.7780 1688.5124 3204.8830 3206.1705 3209.2648 3211.8795 3212.1670 3212.5000 3215.2316 3215.3914 3216.0992 3218.9076 3219.4854 3220.8541 3221.4885 3222.5043 3223.1909 3224.0089 3226.9902 3228.5867 3229.0367 3229.0682 3230.0553 3230.2147 3233.0872 3234.0084 3235.2163 3235.5240 3235.8391 3237.1531 3240.9796 3265.2717 3544.6124
redmass: 5.6808 5.6610 5.1319 5.5924 4.1398 5.8022 4.5080 4.9679 4.9040 5.1260 4.4604 4.3709 5.2829 5.8400 4.6175 4.5806 5.5348 4.1960 5.5495 5.2958 5.9564 5.8665 5.6418 5.4013 5.4847 4.7737 4.9755 5.1043 5.2121 4.9614 6.2062 6.8537 5.3206 7.6559 7.6522 6.8063 6.4470 5.9867 2.8971 2.8511 2.9970 2.9110 2.9361 2.9462 5.1724 5.9241 3.7901 5.2596 4.7436 4.2183 4.4066 4.3809 6.6989 5.1713 5.9522 6.4120 6.3543 6.4375 6.3600 6.3962 5.3519 1.2993 5.2118 5.5830 3.3104 1.8949 1.8021 1.8681 1.6562 1.6866 1.5376 4.6634 4.2683 6.0548 1.6189 1.7601 1.7918 1.8745 2.1226 2.9024 1.3812 1.2859 2.6624 1.5746 1.2531 1.3092 1.2468 7.4616 3.0402 1.3565 1.3759 1.3471 1.3419 1.5031 1.7716 6.1086 5.4656 5.3429 5.8795 5.8195 5.1556 1.3980 1.3841 1.3957 1.3866 1.3871 1.3870 1.3604 1.3567 1.3770 2.2840 1.4453 2.2035 1.3952 1.4271 2.1401 2.2375 2.3009 1.9005 1.4707 1.5156 1.5093 1.3276 1.4035 1.4600 1.5521 2.8498 3.0539 3.3244 3.1330 1.0786 1.0846 1.0809 1.0880 1.0796 1.1000 1.1825 1.3357 1.3140 1.1176 1.1384 1.5932 1.4032 3.1534 1.7284 1.4960 1.6475 1.5516 1.5532 1.4509 2.7510 3.3823 4.4306 3.8709 3.8195 4.4454 6.7152 2.3609 2.3959 2.3686 2.3449 2.5099 2.5262 2.1514 2.2174 2.3064 2.2685 2.4141 2.6691 9.3659 5.8016 6.0819 6.1036 6.1562 6.1527 6.1144 6.3165 6.0955 6.1493 6.0279 6.2658 6.3643 1.0899 1.0891 1.0896 1.0894 1.0877 1.0898 1.0880 1.0903 1.0881 1.0901 1.0927 1.0939 1.0935 1.0910 1.0916 1.0940 1.0974 1.0950 1.0970 1.0979 1.0978 1.0959 1.1014 1.1007 1.1018 1.0988 1.1016 1.1008 1.0991 1.0942 1.0670
irintensity: 1.8241 1.5313 0.0387 0.4029 0.0967 1.1283 0.5213 1.4688 0.6338 0.5210 0.4101 1.0095 1.4350 8.9039 1.2690 0.8740 5.8260 1.6447 0.4619 4.2343 16.2617 4.1790 12.6710 17.4974 2.0399 1.3184 5.2273 5.7976 0.3697 0.4382 9.1958 2.7472 9.2035 14.3122 23.8188 47.3748 3.9375 69.2785 0.6065 0.4869 5.4781 2.7085 4.1792 7.3996 45.1416 30.1886 8.2980 91.2346 6.9511 64.6315 97.6250 88.8386 257.1771 30.6186 3.1472 0.2193 0.4905 0.1250 0.0484 0.2407 27.2698 119.7006 16.8476 0.3523 5.5943 42.2953 121.9590 70.0548 61.6398 55.1006 86.5118 37.6735 63.8932 119.0355 30.2904 32.2947 23.7708 40.2963 39.5449 7.5082 34.1288 17.8559 212.7677 54.4710 3.8747 17.3619 0.4446 255.3739 91.2688 0.7201 0.1845 0.2010 1.2566 7.8815 21.9428 4.3397 8.0750 7.0455 2.9978 2.5117 4.5672 0.1795 0.1382 10.1052 0.0622 2.5928 0.1835 2.1132 0.0579 0.1962 0.4071 0.0321 3.1932 1.4101 0.8764 3.7994 7.6293 3.4192 8.4323 38.7960 21.0877 18.0022 91.9050 5.9947 9.6084 22.0332 158.1267 163.2482 35.6524 205.7839 1.0593 0.7162 0.8460 4.3876 1.1586 3.4513 29.3508 150.4729 105.9946 2.7201 16.0211 164.5647 132.5754 1.3091 87.8929 2.3695 1.2142 5.4487 3.7074 21.7162 430.7416 14.8259 6.0594 4.1170 9.3261 7.5451 43.1233 37.1107 50.1578 26.8349 39.7462 17.5441 52.7416 2.2206 3.7797 2.0928 1.4266 3.3120 81.2699 1310.8318 4.7326 6.3486 1.1382 1.4288 5.3467 108.3756 19.1391 6.8427 11.1446 14.9996 84.7339 5.5380 0.1785 0.0783 0.2919 0.8179 0.4039 0.6563 0.0021 0.2260 0.3021 5.9136 1.7048 0.2735 4.3248 1.6299 0.8868 3.9119 7.5731 3.5994 5.7420 4.9803 1.9216 3.2897 13.3356 6.4927 8.5605 6.4924 8.2162 9.4414 4.7186 8.9922 1134.4711
temp: 298.150 k
press: 1.00000 atm
elementType: 6 6 6 6 1 6 1 6 1 1 1 6 6 6 6 1 6 1 6 1 1 1 15 7 6 6 6 6 6 1 6 1 6 1 1 1 6 6 6 6 1 6 1 6 1 1 1 15 8 6 6 6 6 1 6 1 6 1 1 1 6 6 6 6 1 6 1 6 1 1 1 8 1
symmnumber: 1
zpe: 1541426.9 jmol-1
zpe.correction: 0.587099 hartree
zpe.thermalcorrener: 0.623673 hartree
zpe.thermalcorrenthalpy: 0.624617 hartree
zpe.thermalcorrgfe: 0.512632 hartree
zpe.sumelectzpe: -2313.924608 hartree
zpe.sumelectthermal: -2313.888034 hartree
zpe.sumelectthermalent: -2313.887090 hartree
zpe.sumelectthermalfe: -2313.999075 hartree
dipole: -2.8953 -1.8900 -4.7511
dipole: 5.8760
quadrupole: -186.7013 -200.5472 -201.2723
quadrupole: 0.1317 2.8168 17.3160
quadrupole: 9.4723 -4.3736 -5.0987 0.1317 2.8168 17.3160
hfenergy: -2314.5117069 hartree
pointgroup: C01 [X(C37H31N1O2P2)]
dipole: -1.0713926 -0.8026436 -1.8757413 debye
polarizability: 718.0360046|1.465921|643.4128179|16.8847064|23.0215891|499.1548827 unknown
InChI: InChI=1/C25H20NP.C12H11O2P/c1-5-13-21(14-6-1)25(22-15-7-2-8-16-22)26-27(23-17-9-3-10-18-23)24-19-11-4-12-20-24;13-15(14,11-7-3-1-4-8-11)12-9-5-2-6-10-12/h1-20H;1-10,13H
charge 1 multiplicity 2
73 atoms
C  2.61325656 -0.77845989 -1.47289824
C  3.37925506 -1.76625384 -2.11551201
C  3.22220374 0.40626875 -1.02790129
C  4.73748435 -1.55469319 -2.33217673
H  2.91534183 -2.69412836 -2.45715666
C  4.57851711 0.60731713 -1.2556764
H  2.64842803 1.17126938 -0.50668909
C  5.33690237 -0.36983504 -1.90503521
H  5.32847756 -2.32012413 -2.83874347
H  5.04833844 1.53362565 -0.91939472
H  6.4030692 -0.2061424 -2.07659084
C  0.2674246 -2.25817994 -2.45089967
C  -0.08565455 -3.56686224 -2.10698965
C  0.1075882 -1.79615821 -3.76592757
C  -0.60620055 -4.4163486 -3.08204133
H  0.03417472 -3.91934584 -1.08017521
C  -0.41644828 -2.65216714 -4.72989535
H  0.38547494 -0.77393609 -4.03424631
C  -0.77477035 -3.95804772 -4.38783113
H  -0.88650188 -5.43759915 -2.8165134
H  -0.5458365 -2.29737706 -5.75451711
H  -1.18872429 -4.62405669 -5.14821665
P  0.88798442 -1.13109088 -1.17516227
N  0.02170636 0.29645119 -1.18651513
C  -1.27931986 0.36226111 -1.21945826
C  -2.14529733 -0.82598939 -1.01847258
C  -3.12555363 -1.1630296 -1.96137502
C  -1.94450078 -1.63892475 0.10586203
C  -3.87501008 -2.32342392 -1.79170499
H  -3.27947181 -0.53050421 -2.8382121
C  -2.7244933 -2.77745328 0.2875419
H  -1.18643907 -1.37170293 0.84546392
C  -3.68088388 -3.12614829 -0.66552148
H  -4.61897508 -2.60122867 -2.54094886
H  -2.57811207 -3.39631587 1.17503825
H  -4.28153552 -4.02837548 -0.53065631
C  -1.89569521 1.6829747 -1.43665186
C  -3.22640862 1.92540709 -1.05685606
C  -1.1335155 2.7284785 -1.98763334
C  -3.77742155 3.19323027 -1.21484856
H  -3.8225175 1.12929112 -0.6084008
C  -1.69054694 3.99084181 -2.14795335
H  -0.10485449 2.53744729 -2.3001994
C  -3.0119902 4.22509343 -1.75881564
H  -4.80825577 3.37814763 -0.90638005
H  -1.09585277 4.79677371 -2.58236119
H  -3.44753701 5.21913165 -1.88305906
P  0.81517068 0.84119165 1.95293676
O  1.24256103 -0.49646753 1.39484146
C  1.89696286 1.42515392 3.26530887
C  1.55653185 2.53719284 4.0457724
C  3.108225 0.75803114 3.47618799
C  2.43420115 2.98203947 5.03129633
H  0.60611626 3.05444837 3.88793406
C  3.98130363 1.20735473 4.46584261
H  3.36037833 -0.11147785 2.86478982
C  3.644823 2.31764806 5.24026577
H  2.1723684 3.84923043 5.64132357
H  4.92711337 0.68749115 4.63339364
H  4.32973498 2.66804986 6.01596466
C  -0.89105714 0.82141185 2.54235805
C  -1.8228533 1.77560018 2.1216448
C  -1.29029644 -0.2223117 3.39031054
C  -3.15094808 1.67947788 2.53864064
H  -1.51591975 2.58815969 1.45988451
C  -2.61531053 -0.31105864 3.80563327
H  -0.56510848 -0.9730691 3.71550607
C  -3.54669887 0.63762526 3.37560933
H  -3.87841621 2.42164504 2.20294875
H  -2.926235 -1.12580168 4.46306578
H  -4.58762475 0.56318925 3.69856976
O  0.88088867 2.04544352 0.8699659
H  0.58404842 1.71105287 -0.00440711
