program: Gaussian 16
title: prereaction
version: ES64L-G16RevC.02
basis: def2SVP
method: UwB97XD
operation: Freq
keyword: #p
keyword: freq
keyword: uwb97xd
keyword: scrf=(smd,solvent=dichloromethane)
keyword: nosymm
keyword: guess=(biorthogonalize)
keyword: def2svp
keyword: scf=xqc
title: #p freq uwb97xd scrf=(smd,solvent=dichloromethane) nosymm guess=(biort
basis: NPDir=0 NMtPBC= 1 NCelOv= 1 NCel= 1 NClECP= 1 NCelD= 1
basis: NCelK= 1 NCelE2= 1 NClLst= 1 CellRange= 0.0.
basis: One-electron integrals computed using PRISM.
converged: NO NO NO NO
polarizability: 6.47356548e+02 2.47807312e+01 6.06962185e+02 1.28047617e+01 -8.81741893e+00 5.54531010e+02
1716.lowfreq: -135.3382 -0.0011 -0.0006 0.0007 6.2778 9.3777 14.8777 22.7850 26.4167
frequency: -135.3259 22.7391 25.8014 28.4315 30.2905 38.6961 47.1102 48.9455 49.9141 53.4650 58.2373 64.5116 68.1399 79.4795 84.0930 93.1796 96.4424 99.4858 122.0998 132.3431 164.5450 175.1898 180.0376 195.3099 218.5845 230.0119 234.4461 254.9811 260.1077 262.9182 284.5471 300.3588 304.3260 318.1413 337.1458 379.1634 405.1055 412.1639 412.7108 418.9988 419.7384 421.5924 424.2857 432.0361 454.5141 459.1141 470.2394 480.6317 492.9037 498.5841 524.6720 535.3346 547.8599 601.0956 611.9119 627.1302 629.3902 630.1108 630.5820 632.2466 633.0706 672.5396 694.6263 702.9557 716.9486 719.2471 720.7595 721.6315 723.3438 726.8634 728.8997 731.0416 746.8048 751.0769 770.9948 780.1960 782.6009 784.1872 794.0616 800.7039 816.8534 848.7531 876.8997 878.1381 884.5891 885.0034 887.8178 889.8161 952.2458 970.4688 973.6628 979.5306 980.5183 986.9406 987.1800 1011.4248 1014.5737 1018.3750 1019.2243 1019.2879 1022.7292 1024.9566 1027.8259 1028.8611 1030.3958 1033.7086 1041.5519 1052.3859 1052.4924 1052.7333 1052.9581 1053.5936 1055.2523 1056.4168 1060.0550 1060.6364 1060.8846 1062.4670 1063.0338 1090.3419 1104.5244 1111.3802 1115.5604 1115.7755 1119.6715 1119.9164 1130.8426 1138.9166 1160.3426 1168.6836 1168.9133 1169.9402 1171.1608 1172.4154 1172.5905 1189.4537 1195.3963 1196.5397 1199.6357 1203.4760 1205.8408 1208.9051 1232.8513 1302.6676 1323.8688 1328.8862 1334.9458 1335.3630 1335.9078 1336.8439 1366.8622 1370.0696 1371.6171 1371.8038 1372.8717 1375.9391 1444.3937 1475.3983 1478.9285 1479.1228 1480.1378 1486.3156 1492.3507 1517.2995 1523.6802 1524.4561 1530.8454 1533.6183 1547.4382 1653.3516 1657.7087 1664.3795 1665.1890 1666.0561 1666.4616 1670.1776 1673.4977 1679.4596 1681.2443 1684.4554 1691.4037 1691.9728 3205.2008 3205.6414 3206.1478 3209.7729 3210.3045 3211.4054 3212.1979 3212.7551 3213.6571 3216.2690 3216.7206 3218.8127 3219.1996 3220.1914 3221.5076 3223.6284 3224.6498 3225.5596 3225.6656 3227.1740 3230.0913 3230.4272 3232.0645 3232.7307 3232.8278 3234.1803 3236.6025 3236.6966 3237.7942 3246.3145 3514.6442
redmass: 10.3268 5.2932 5.8168 4.3150 5.0096 5.4012 4.5417 5.3936 4.3966 5.1259 4.4693 4.6696 4.9923 4.1334 3.9599 4.6215 4.3637 5.6997 5.7024 5.5804 7.6405 5.6909 5.3436 5.4681 4.9157 5.2530 5.0476 4.9980 5.1545 5.3411 6.2984 5.7129 6.3299 7.1048 6.9628 6.6760 6.0557 2.9122 2.8539 2.9270 3.0123 2.9322 2.9084 5.9584 4.0830 5.3482 4.5502 4.3571 4.5713 4.4811 5.5178 5.3841 7.7145 4.6529 8.1262 6.4265 6.4079 6.4567 6.3363 6.3695 6.5343 5.3267 6.9510 3.4434 1.8941 3.8480 1.9444 2.4846 1.7420 1.9635 1.6735 2.2470 3.4713 6.2851 1.7288 1.8268 1.7075 1.8480 1.8832 3.1499 3.0591 2.0572 1.2530 1.2481 1.2466 1.2446 1.2535 1.2438 3.4133 1.3521 1.3612 1.3979 1.3623 1.3618 1.6276 6.4190 5.5013 5.7460 5.4896 5.6547 5.1883 1.3905 1.4017 1.3957 1.3910 1.3850 1.3756 1.4026 1.9082 1.4710 2.0230 1.3566 1.3812 1.9038 2.1681 2.4857 2.3893 1.8770 1.3590 2.1185 1.4722 1.5206 1.4627 1.5118 1.4614 1.5094 3.1266 3.1461 3.0617 1.0952 1.0794 1.0822 1.0788 1.0814 1.0846 1.1598 1.1093 1.1914 1.1223 1.1228 2.5717 1.1626 10.0196 2.1062 1.4365 1.6066 1.4439 1.6325 1.6720 1.4412 3.9237 4.8632 3.4791 3.1280 4.1913 5.1844 1.7117 2.3533 2.3887 2.3792 2.3732 2.4956 2.4505 2.1608 2.1297 2.3256 2.2570 2.4221 2.8047 6.7179 6.0627 6.0302 6.2002 6.1033 6.2249 6.2562 5.9490 7.4480 6.1871 6.0441 6.9399 6.4479 1.0895 1.0893 1.0884 1.0917 1.0904 1.0894 1.0901 1.0878 1.0882 1.0899 1.0933 1.0911 1.0932 1.0915 1.0944 1.0928 1.0973 1.0966 1.0941 1.0960 1.0987 1.0970 1.1015 1.0979 1.1014 1.1004 1.0986 1.1008 1.1014 1.0954 1.0768
irintensity: 116.4745 1.3393 0.4548 0.5264 0.0433 0.2984 0.2263 0.2573 0.3823 1.2462 0.7857 0.5071 0.2257 0.8913 1.2733 1.4389 2.2533 0.0389 0.1424 1.5847 11.3899 10.2810 4.2685 6.7618 6.9145 2.8223 2.6526 3.8682 1.1975 5.6978 12.9685 1.3178 6.7352 122.4160 1.0097 61.6226 57.0286 1.2598 1.1571 6.7568 13.2106 10.7905 3.2868 74.0056 2.7776 35.4860 24.9986 29.4779 37.2531 76.7005 21.3476 202.2302 378.1597 10.9555 31.6613 0.3605 0.7708 1.9941 0.1624 0.0358 3.0476 33.8418 11.4586 21.7066 69.6716 15.4510 78.8498 26.0991 64.4462 50.1532 53.7226 59.0144 18.5639 127.6187 163.9603 14.1187 32.1396 2.5398 29.5120 445.7999 895.9129 404.5736 6.6072 0.3542 0.7034 2.0870 0.2556 0.1905 35.9205 0.4983 0.9341 6.3217 2.4130 2.9128 8.2126 2.5083 5.0630 1.8615 1.5233 6.0068 1.9042 0.1418 1.0295 0.0702 1.9974 0.4052 0.2819 0.6550 0.5008 1.2783 2.0212 0.0324 0.2532 1.7106 2.4508 3.5282 4.2235 8.9847 0.7859 72.7198 19.2240 11.5865 11.9587 14.0640 6.8527 4.1085 101.8519 30.7221 193.5587 2.5976 0.4978 0.4212 1.5124 1.7305 0.6010 2.1209 8.2938 14.8964 2.6909 7.5588 14.0850 13.0054 245.2082 174.2582 6.0482 2.4388 10.7818 3.4274 0.9666 2.2647 8.0650 3.5509 2.2886 6.1903 6.6143 13.6020 129.4163 42.1532 38.7584 51.8838 23.4279 4.7918 73.2732 5.6892 8.4223 3.3743 2.6576 4.2520 36.3430 277.2390 76.6504 6.8921 2.1888 1.4112 3.5756 0.8196 21.3079 304.1782 18.1816 15.1871 118.3631 17.8626 0.1914 0.0724 0.6711 47.2204 0.2060 1.1283 0.5153 0.1920 0.0647 10.9495 0.0968 0.8870 1.7013 3.4696 5.0793 0.8295 6.4642 7.6661 1.6331 7.1792 7.0635 5.7483 9.4159 4.2515 9.5730 5.2639 3.7991 16.5140 5.6198 12.1119 247.9020
temp: 298.150 k
press: 1.00000 atm
elementType: 6 6 6 6 1 6 1 6 1 1 1 6 6 6 6 1 6 1 6 1 1 1 15 7 6 6 6 6 6 1 6 1 6 1 1 1 6 6 6 6 1 6 1 6 1 1 1 15 8 6 6 6 6 1 6 1 6 1 1 1 6 6 6 6 1 6 1 6 1 1 1 8 1
symmnumber: 1
zpe: 1542189.0 jmol-1
zpe.correction: 0.587389 hartree
zpe.thermalcorrener: 0.622891 hartree
zpe.thermalcorrenthalpy: 0.623835 hartree
zpe.thermalcorrgfe: 0.516723 hartree
zpe.sumelectzpe: -2313.901377 hartree
zpe.sumelectthermal: -2313.865875 hartree
zpe.sumelectthermalent: -2313.864930 hartree
zpe.sumelectthermalfe: -2313.972043 hartree
dipole: -3.2508 -2.6163 -3.5092
dipole: 5.4523
quadrupole: -191.8435 -213.9467 -196.1475
quadrupole: -2.0622 5.9862 1.2863
quadrupole: 8.8024 -13.3008 4.4984 -2.0622 5.9862 1.2863
hfenergy: -2314.4887655 hartree
pointgroup: C01 [X(C37H31N1O2P2)]
dipole: -1.2960318 -1.0637723 -1.3946395 debye
polarizability: 647.3565475|24.7807312|606.9621851|12.8047617|-8.8174189|554.5310097 unknown
InChI: InChI=1/C24H20O2P2.C13H11N/c25-28(23-17-9-3-10-18-23,24-19-11-4-12-20-24)26-27(21-13-5-1-6-14-21)22-15-7-2-8-16-22;14-13(11-7-3-1-4-8-11)12-9-5-2-6-10-12/h1-20H;1-10,14H
charge 1 multiplicity 2
73 atoms
C  2.740654 -0.46459 -1.205461
C  3.450505 -1.324379 -2.062643
C  3.290902 0.78034 -0.861011
C  4.684424 -0.934349 -2.574074
H  3.046941 -2.302639 -2.330562
C  4.520048 1.164932 -1.390698
H  2.755781 1.466524 -0.20084
C  5.219535 0.311028 -2.243344
H  5.229984 -1.609903 -3.236079
H  4.933551 2.141302 -1.129872
H  6.186118 0.615923 -2.650463
C  0.457979 -2.15571 -1.808429
C  0.060883 -3.442537 -1.447189
C  0.346493 -1.721802 -3.136813
C  -0.46785 -4.299653 -2.414243
H  0.151884 -3.775364 -0.410293
C  -0.168719 -2.585975 -4.096956
H  0.661733 -0.714996 -3.42241
C  -0.58194 -3.871561 -3.734745
H  -0.790513 -5.303681 -2.130874
H  -0.25317 -2.253891 -5.134048
H  -0.995092 -4.542664 -4.491128
P  1.20525 -1.072013 -0.4876
N  -0.104636 0.448147 -1.021234
C  -1.372776 0.431421 -1.267841
C  -2.182529 -0.785799 -1.040531
C  -3.0280 -1.261141 -2.051823
C  -2.117708 -1.45654 0.186785
C  -3.773697 -2.417196 -1.843109
H  -3.083211 -0.736634 -3.008079
C  -2.893208 -2.591781 0.402104
H  -1.479075 -1.077322 0.984783
C  -3.712788 -3.078904 -0.615125
H  -4.412465 -2.800124 -2.64148
H  -2.850897 -3.098753 1.368128
H  -4.311626 -3.977388 -0.450474
C  -2.032287 1.657135 -1.759959
C  -3.371078 1.913587 -1.425514
C  -1.317323 2.587049 -2.531743
C  -3.976287 3.09597 -1.839818
H  -3.929776 1.197154 -0.820566
C  -1.932834 3.759989 -2.954553
H  -0.285239 2.380631 -2.82556
C  -3.259458 4.017668 -2.603946
H  -5.013371 3.298756 -1.565508
H  -1.377521 4.47448 -3.565214
H  -3.739723 4.941523 -2.933953
P  0.869098 1.066068 1.805303
O  1.169907 -0.376994 1.072397
C  2.033748 1.015981 3.179374
C  1.955316 2.042753 4.131269
C  3.021374 0.031385 3.287848
C  2.861339 2.077911 5.187727
H  1.185475 2.815423 4.049097
C  3.926118 0.073858 4.348096
H  3.081363 -0.76672 2.545733
C  3.845976 1.093657 5.295848
H  2.799258 2.876613 5.929951
H  4.696936 -0.695145 4.433579
H  4.555344 1.122903 6.12618
C  -0.80626 0.910653 2.446934
C  -1.805071 1.72534 1.904105
C  -1.126902 -0.056376 3.40847
C  -3.128155 1.56118 2.311465
H  -1.543635 2.479139 1.158114
C  -2.450019 -0.215085 3.811511
H  -0.345008 -0.689883 3.835711
C  -3.449781 0.589215 3.258633
H  -3.909668 2.195047 1.886904
H  -2.704558 -0.96965 4.558724
H  -4.487378 0.459482 3.574682
O  1.016122 2.245154 0.887221
H  0.355798 1.364562 -1.030242
