program: Gaussian 16
title: prereaction
version: ES64L-G16RevC.02
method: UwB97XD
basis: def2SVP
operation: Freq
keyword: #P
keyword: Geom=AllCheck
keyword: Guess=TCheck
keyword: SCRF=Check
keyword: GenChk
keyword: UwB97XD/def2SVPFreq
converged: YES YES NO NO
polarizability: 4.30258867e+02 9.43861123e+01 4.18227897e+02 5.74664479e+00 4.72648608e+00 4.15472926e+02
1716.lowfreq: -1.9486 -0.0003 0.0008 0.0017 7.7317 13.0796 15.3195 21.7732 26.8121
frequency: 5.2693 20.9461 26.6918 31.5261 38.9688 42.7306 44.3088 63.9236 71.9076 77.4695 88.1613 99.9592 112.2627 132.3856 165.9155 174.9054 179.5078 203.4729 231.0183 236.2466 255.2120 258.6119 284.9507 300.6166 318.4515 326.6358 336.8043 390.2272 399.9826 405.8705 414.1201 420.6197 423.5655 444.6293 465.2727 488.1501 502.5933 505.4451 534.2518 552.3743 623.6593 624.1865 628.2566 631.1833 657.4045 682.1368 704.3976 713.1640 715.5993 725.5219 730.6490 733.6879 754.4270 757.2850 775.9699 778.2171 785.4814 789.3223 870.7088 878.5147 890.1582 899.3115 954.3925 979.2699 982.1608 984.5448 994.9413 1013.1906 1016.3019 1017.8411 1018.8498 1028.7861 1030.6925 1035.4260 1050.6902 1054.3680 1056.5859 1056.7239 1059.0305 1060.2794 1060.9093 1061.1811 1079.5047 1109.4599 1114.7805 1117.2988 1118.9352 1124.6928 1130.9083 1139.0219 1161.8862 1173.4773 1174.6994 1175.1896 1176.3876 1193.3895 1199.5194 1203.2751 1209.4161 1259.9738 1325.4000 1330.1830 1334.8532 1341.6337 1370.8037 1374.4343 1376.1307 1377.0503 1475.6291 1479.2804 1479.6772 1482.2212 1512.4545 1516.1071 1523.2674 1533.4977 1647.8664 1650.3636 1658.5536 1659.2794 1663.6280 1665.6387 1666.1537 1680.2870 1682.8331 3189.3512 3208.8252 3211.4357 3212.2740 3215.0922 3215.6656 3215.7667 3221.1294 3222.1588 3222.8233 3226.4885 3229.2156 3229.9485 3230.5227 3234.2525 3236.5354 3236.6061 3237.1759 3241.5860 3242.3606 3720.0890 3901.1273
redmass: 5.7702 5.9447 6.0782 6.1520 4.3132 4.1038 4.6764 4.4464 5.4625 4.4346 4.1205 6.6996 5.5365 7.1789 5.5983 5.2787 5.3699 6.5238 5.4718 5.1343 4.3827 5.3197 1.1431 2.8271 2.2962 2.4362 7.6058 6.4504 6.7313 2.8107 2.8650 2.9347 2.9052 6.4735 3.7201 6.1684 4.2834 6.9908 4.8744 7.6603 6.4345 6.4092 5.6268 6.4175 1.7065 2.3965 1.8386 4.0864 2.3071 2.3581 3.4810 1.9695 6.1647 5.5146 1.6016 1.6910 1.6916 1.7567 1.2544 1.2377 1.2441 1.2455 12.3517 1.3584 1.3309 1.3556 1.3495 5.7207 5.7561 5.7011 5.9779 1.3926 1.4078 1.3862 1.3700 2.3751 2.1975 2.3076 1.3833 1.4173 2.1131 1.4557 1.3147 1.4702 1.5810 1.8189 1.5605 2.2460 3.1127 3.1110 2.9690 1.0890 1.1035 1.0812 1.0848 1.1655 1.1582 1.1374 1.1360 13.5670 1.4509 1.5258 1.5086 1.8607 4.9777 4.1461 2.6994 4.2761 2.3888 2.3562 2.4176 2.3853 2.1172 2.1336 2.3017 2.1755 5.6238 5.7535 1.0878 5.6626 5.9939 5.8325 5.8963 6.1645 5.8652 1.0949 1.0909 1.0922 1.0885 1.0916 1.0909 1.0915 1.0939 1.0900 1.0898 1.0962 1.0933 1.0976 1.0931 1.1007 1.1016 1.0979 1.0978 1.1017 1.1014 1.0582 1.0697
irintensity: 0.2897 1.0968 1.8089 0.8704 0.3148 0.5557 0.1397 0.2548 1.2300 0.2866 0.5544 10.8550 0.6522 3.5469 2.1718 2.4333 1.1907 12.7978 6.4989 9.8535 7.3907 4.6229 147.9434 17.0654 52.1458 51.6204 9.2785 2.0136 66.1131 1.9818 1.0635 6.6506 0.7186 30.1638 45.2926 71.7852 36.2039 118.6418 157.4076 291.0972 0.1292 2.6593 7.3057 0.9762 311.0056 132.3143 65.3209 11.6720 53.1077 12.7074 201.8572 71.9402 24.2905 171.3054 44.2768 48.5803 12.3619 5.5490 0.6582 0.9548 0.0282 1.7388 1141.8068 6.5784 2.3810 9.7593 3.4705 12.9993 8.8657 16.0357 18.2097 0.2411 1.0724 0.2127 0.1154 0.2534 4.2747 1.6894 0.2924 0.3058 2.0300 0.3365 0.3196 11.4413 23.2844 121.1186 10.4637 234.8602 166.3534 34.0300 228.1557 1.0997 3.5154 1.5315 1.6885 1.1331 5.1848 0.8671 1.9273 334.9080 7.2386 1.4592 1.7290 1.5504 1.5091 11.0808 6.5517 20.2859 32.0939 26.5159 61.1710 65.6788 1.6883 2.6753 1.6688 1.4303 1.9740 4.4956 92.6156 184.4800 2.6196 2.2976 41.7388 16.1259 24.1829 41.7150 0.4753 0.9593 0.6416 3.6501 0.5614 0.4653 0.2046 0.2501 0.8451 4.7621 0.9999 4.0838 0.1569 8.7957 7.5359 0.1494 0.5674 9.7228 4.3336 613.3309 140.7087
temp: 298.150 k
press: 1.00000 atm
elementType: 6 6 6 6 1 6 1 6 1 1 1 6 6 6 6 1 6 1 6 1 1 1 15 15 8 6 6 6 6 1 6 1 6 1 1 1 6 6 6 6 1 6 1 6 1 1 1 8 8 1 1
symmnumber: 1
zpe: 1062946.9 jmol-1
zpe.correction: 0.404855 hartree
zpe.thermalcorrener: 0.432208 hartree
zpe.thermalcorrenthalpy: 0.433153 hartree
zpe.thermalcorrgfe: 0.341580 hartree
zpe.sumelectzpe: -1834.240898 hartree
zpe.sumelectthermal: -1834.213544 hartree
zpe.sumelectthermalent: -1834.212600 hartree
zpe.sumelectthermalfe: -1834.304173 hartree
dipole: 7.0681 -7.4061 -3.9148
dipole: 10.9606
quadrupole: -126.0126 -168.1274 -130.2292
quadrupole: 16.7588 -3.3706 -8.6828
quadrupole: 15.4438 -26.6710 11.2272 16.7588 -3.3706 -8.6828
hfenergy: -1834.6457529 hartree
pointgroup: C01 [X(C24H22O3P2)]
dipole: 0.7456966 -3.2953612 -2.9429379 debye
polarizability: 430.2588675|94.3861123|418.2278966|5.7466448|4.7264861|415.4729264 unknown
InChI: InChI=1/C24H20O2P2.H2O/c25-28(23-17-9-3-10-18-23,24-19-11-4-12-20-24)26-27(21-13-5-1-6-14-21)22-15-7-2-8-16-22;/h1-20H;1H2
charge 1 multiplicity 2
51 atoms
C  2.8637423 0.4458749 -1.72904843
C  3.25419322 -0.3511636 -2.81932998
C  3.6373081 1.55024674 -1.32278452
C  4.43800114 -0.04964181 -3.48263278
H  2.65573635 -1.20851233 -3.13297004
C  4.81764558 1.83305538 -1.99685584
H  3.31785106 2.17504982 -0.48483975
C  5.21547043 1.03628604 -3.07379514
H  4.75969405 -0.6712141 -4.32014966
H  5.42951007 2.68087062 -1.68386718
H  6.14366324 1.26524873 -3.60182682
C  0.50873149 -1.37768338 -1.14632414
C  0.29570751 -2.29321103 -0.10135801
C  -0.02023439 -1.60758896 -2.4296251
C  -0.41771478 -3.45730875 -0.3603315
H  0.69076464 -2.10197738 0.89771847
C  -0.72612452 -2.77985291 -2.67069458
H  0.11729088 -0.87465664 -3.22880497
C  -0.92432386 -3.70043876 -1.63902704
H  -0.57896683 -4.180356 0.44117678
H  -1.13387626 -2.97119043 -3.66478775
H  -1.48623242 -4.61658055 -1.83299616
P  1.35978556 0.1457133 -0.84102424
P  0.92515765 1.28566215 1.84982052
O  1.69208782 0.27901014 0.7264487
C  1.78696166 0.79468513 3.33852448
C  1.90027702 1.7565364 4.35217039
C  2.32304977 -0.48922737 3.50965896
C  2.53938549 1.42051921 5.54375926
H  1.50090998 2.76494022 4.20472202
C  2.96099752 -0.81149296 4.70435281
H  2.25150685 -1.23264905 2.71261933
C  3.06565633 0.14080517 5.71981811
H  2.63041858 2.16591428 6.33649268
H  3.38282192 -1.80918143 4.84145272
H  3.56789904 -0.11652528 6.6551566
C  -0.76740076 0.68725703 1.80458087
C  -1.6664408 1.35155979 0.95884379
C  -1.1743535 -0.44378221 2.52386652
C  -2.96342534 0.86443487 0.81473912
H  -1.34915774 2.24583225 0.41722813
C  -2.47459275 -0.91996275 2.37719538
H  -0.48324617 -0.95280391 3.1997613
C  -3.3640976 -0.27125207 1.51896074
H  -3.66533956 1.37725599 0.15407722
H  -2.79555685 -1.80068298 2.93698376
H  -4.38213436 -0.65035551 1.4049103
O  1.0775423 2.71137616 1.42905832
O  0.83353567 4.78974734 3.30021062
H  1.74822201 5.09330427 3.34487005
H  0.85307218 4.15568814 2.56230231
