program: Gaussian 16
title: int2
version: ES64L-G16RevC.02
method: UwB97XD
basis: def2SVP
operation: Freq
keyword: #P
keyword: Geom=AllCheck
keyword: Guess=TCheck
keyword: SCRF=Check
keyword: GenChk
keyword: UwB97XD/def2SVP
keyword: Freq
converged: YES YES YES YES
polarizability: 3.54340127e+02 6.48783055e+00 3.94484391e+02 -2.09050753e+01 2.48979123e+01 2.77712736e+02
1716.lowfreq: 0.0012 0.0020 0.0021 3.9674 5.7117 9.5628 18.0170 24.5146 31.0069
frequency: 17.9445 24.4634 30.9389 38.0387 39.6153 51.5787 70.5534 89.4112 114.5799 117.5213 150.7068 165.1750 186.1852 198.9596 218.5269 243.4914 249.9202 287.7637 306.0078 329.0936 349.2189 387.5157 416.1155 419.9697 423.6887 425.5924 457.9060 460.3037 471.7466 528.0752 557.8625 587.1151 629.6339 631.2969 633.0667 640.1442 687.5887 708.1535 725.1320 725.5817 726.9021 730.9152 746.0620 782.1965 790.7716 817.5444 820.3580 884.7563 887.1302 890.8759 897.6929 959.8301 972.7036 979.0653 979.2762 1008.2229 1018.8069 1019.3334 1020.4243 1029.8783 1031.7720 1032.8379 1051.4870 1052.5297 1053.4193 1056.3636 1057.2566 1060.1896 1098.7777 1103.3490 1108.3043 1110.6259 1119.3137 1133.3418 1146.6610 1150.0333 1166.6723 1167.8619 1168.4738 1170.3324 1185.3564 1186.4646 1189.6331 1197.7349 1234.9975 1254.4723 1297.3816 1318.3544 1322.0429 1323.8613 1334.2406 1364.2431 1368.7406 1372.8315 1425.5152 1447.6165 1477.6746 1478.4425 1480.4164 1507.0385 1522.9837 1525.0628 1543.2118 1640.3984 1664.1625 1667.1580 1679.2559 1682.6028 1683.3390 1692.5272 3020.1924 3031.0429 3089.7518 3098.0663 3205.6292 3206.1010 3206.7684 3213.0835 3213.7158 3216.2562 3218.9208 3219.8238 3225.4529 3225.4684 3226.2528 3230.4598 3231.0146 3233.0689 3246.3941
redmass: 5.6857 4.6084 5.0428 4.1817 5.1510 5.2253 4.6465 5.3929 3.1383 4.4742 6.5539 5.3929 4.3960 5.6721 5.1324 5.0691 5.3280 2.3608 7.5067 5.7983 5.0826 5.9903 2.8259 3.4635 3.1822 3.8098 4.1223 4.0685 4.7801 4.3233 7.3920 5.7182 6.3219 6.4040 6.4045 6.3432 3.9409 6.1526 2.8977 1.7274 1.9931 1.6615 5.1474 1.9233 1.9106 1.7712 1.5760 1.2625 1.2476 1.2515 4.9546 3.5790 1.3715 1.3992 1.4678 1.9876 6.0437 5.9052 5.1061 1.3902 1.3926 1.3822 1.4065 1.4044 1.4594 1.9962 2.1141 1.9472 1.4803 1.4862 1.5262 1.8849 1.9546 2.7089 2.2580 2.8478 1.1046 1.0905 1.0898 1.3909 1.4105 1.1973 1.1503 1.6852 4.3181 5.9877 2.0825 1.4489 1.7849 1.4394 1.4769 5.5172 5.7775 6.4126 1.0738 1.1133 2.3511 2.9034 2.3737 4.2869 2.3628 2.3475 2.9510 9.9863 6.2773 6.3131 7.3377 6.2724 6.2554 6.3655 1.0595 1.0624 1.1049 1.1051 1.0871 1.0871 1.0876 1.0899 1.0901 1.0920 1.0939 1.0942 1.0967 1.0973 1.0972 1.1012 1.1010 1.0975 1.0945
irintensity: 0.4819 0.9181 1.6759 0.2186 0.4166 1.7322 0.5675 0.5771 1.3324 4.5294 6.3189 2.2223 9.3891 16.8256 4.2491 3.6206 6.8721 14.0139 9.8430 1.3044 7.5958 2.8173 0.4729 10.4332 4.4884 13.1753 11.6869 12.9441 11.6787 89.9343 157.7879 117.1498 19.5256 0.1924 1.8175 30.8039 35.1937 11.2602 42.4891 42.6791 98.1072 107.9128 109.5584 0.0790 5.0982 7.8410 8.1419 0.2055 0.0512 0.8948 32.2353 34.2288 0.0506 2.0184 2.3348 29.7624 1.8727 1.6757 0.3194 0.1040 1.5769 0.7658 2.7986 1.4281 1.8264 9.1949 4.8476 13.7073 0.9014 36.0722 48.6523 83.0020 91.6202 21.6640 313.3544 147.7569 3.2338 0.3428 0.3739 21.7275 42.2289 3.7566 2.3576 5.2903 202.0027 379.6728 10.5668 0.9162 12.1140 3.7621 7.4265 0.9726 3.1600 7.3186 18.4549 32.7700 3.2830 26.4410 58.9389 154.5690 3.5351 1.7675 28.9823 166.7035 0.0112 0.5976 32.3982 9.6113 7.3577 20.5469 27.7794 19.6728 7.3562 8.8092 0.0695 0.2657 0.4376 0.6837 6.6069 7.4114 5.1056 1.7542 10.4648 4.3781 16.2527 15.4939 7.5658 9.0146 3.4408
temp: 298.150 k
press: 1.00000 atm
elementType: 6 6 6 1 1 1 1 7 6 8 6 6 6 6 1 6 1 6 1 1 1 15 8 6 6 6 6 1 6 1 6 1 1 1 6 6 6 6 1 6 1 6 1 1 1
symmnumber: 1
zpe: 941603.2 jmol-1
zpe.correction: 0.358638 hartree
zpe.thermalcorrener: 0.380864 hartree
zpe.thermalcorrenthalpy: 0.381809 hartree
zpe.thermalcorrgfe: 0.303053 hartree
zpe.sumelectzpe: -1394.761222 hartree
zpe.sumelectthermal: -1394.738995 hartree
zpe.sumelectthermalent: -1394.738051 hartree
zpe.sumelectthermalfe: -1394.816807 hartree
dipole: 0.7521 1.5506 5.4487
dipole: 5.7148
quadrupole: -161.1029 -118.7517 -142.3792
quadrupole: 4.0829 2.9429 11.8460
quadrupole: -20.3583 21.9929 -1.6346 4.0829 2.9429 11.8460
hfenergy: -1395.1198597 hartree
pointgroup: C01 [X(C22H19N1O2P1)]
dipole: 0.2959109 0.6100705 2.1436944 debye
polarizability: 354.3401272|6.4878306|394.4843913|-20.9050753|24.8979123|277.7127364 unknown
InChI: InChI=1/C22H19NO2P/c24-22(18-10-4-1-5-11-18)19-16-23(17-19)26(25,20-12-6-2-7-13-20)21-14-8-3-9-15-21/h1-15H,16-17H2
charge 0 multiplicity 2
45 atoms
C  1.11408485 1.28213333 0.29539892
C  1.53701618 2.70800066 0.16384412
C  0.55209641 3.12399709 1.21413304
H  0.56464994 0.89261702 -0.5825372
H  1.90892029 0.56312214 0.55752531
H  -0.3022337 3.71218867 0.82764256
H  0.96645667 3.64621674 2.09427362
N  0.25269353 1.69128819 1.43095071
C  2.62690412 3.25701094 -0.58833432
O  3.31595585 2.49013597 -1.2696154
C  2.9509948 4.72008998 -0.523468
C  2.05136007 5.68346711 -0.04813384
C  4.2112468 5.13093657 -0.97951258
C  2.41066854 7.03059098 -0.02300979
H  1.05271366 5.39936463 0.2853595
C  4.5721479 6.47434707 -0.94672083
H  4.9022522 4.37572417 -1.35906233
C  3.67150902 7.4278446 -0.46695885
H  1.69844581 7.77349172 0.34290846
H  5.55970469 6.78179928 -1.29835957
H  3.95235165 8.48342491 -0.44282262
P  -1.30704156 1.10787826 1.6655358
O  -2.32545316 1.32540187 0.58241096
C  -1.01449896 -0.65539712 1.97786826
C  0.06644801 -1.11525299 2.74186687
C  -1.91927281 -1.57152335 1.43058763
C  0.23286336 -2.48116828 2.96023353
H  0.7838894 -0.40480812 3.1591712
C  -1.75010939 -2.93792748 1.65234254
H  -2.75181121 -1.20379256 0.82634201
C  -0.67592687 -3.3920445 2.4174995
H  1.07756003 -2.8377224 3.55405617
H  -2.45830325 -3.65053114 1.22342415
H  -0.54270164 -4.46272171 2.59017783
C  -1.78642585 1.92328883 3.2149141
C  -0.91206478 2.04106963 4.30358433
C  -3.08203452 2.44311321 3.30352714
C  -1.33667954 2.66979816 5.47200627
H  0.10431364 1.64611615 4.23493714
C  -3.50394151 3.07138756 4.47511311
H  -3.75214192 2.35436125 2.44531069
C  -2.63255451 3.18360288 5.55834522
H  -0.65313613 2.76196756 6.31908425
H  -4.51637603 3.4763377 4.54109913
H  -2.96301007 3.67666481 6.47572127
