program: Gaussian 16
title: 3aO-
version: ES64L-G16RevC.02
method: UwB97XD
basis: def2SVP
operation: Freq
keyword: #P
keyword: Geom=AllCheck
keyword: Guess=TCheck
keyword: SCRF=Check
keyword: GenChk
keyword: UwB97XD/def2SVPFreq
converged: YES YES YES YES
polarizability: 3.18203919e+02 1.58482582e+01 4.13166543e+02 -6.53064555e+01 -1.33609416e+01 3.38701507e+02
1716.lowfreq: -8.3606 -7.4574 -6.1958 -0.0019 -0.0012 -0.0009 14.6000 22.1185 29.5327
frequency: 14.2513 21.8782 28.9392 33.2211 36.4202 49.1063 60.4931 84.4367 112.9503 129.4290 144.8254 159.2578 192.7922 210.2767 216.7685 242.3445 243.6661 273.7616 303.6365 322.2554 347.9086 380.8219 414.5686 418.1184 422.7841 430.3478 458.0453 462.4060 478.9100 526.0138 560.7292 593.1024 631.1290 631.7064 634.2488 643.1937 700.8453 708.1579 725.1428 726.1214 728.2961 733.2243 742.3844 780.9646 790.4553 822.7884 884.7566 885.9632 886.4630 897.1055 960.4228 969.4435 970.3209 974.0011 977.8306 1016.5010 1018.3438 1018.6284 1022.0708 1026.9063 1028.9098 1032.5563 1043.9738 1049.5794 1050.3910 1050.9655 1053.7131 1054.4324 1084.5656 1093.0050 1095.3393 1101.8489 1118.9420 1130.3086 1144.4101 1146.2707 1152.3641 1162.2503 1165.8623 1166.4461 1175.1336 1182.0002 1183.8172 1188.8292 1220.0032 1243.8000 1285.8678 1313.6968 1316.9526 1317.1155 1318.7909 1362.2720 1366.4499 1366.7564 1476.5857 1477.4817 1478.3283 1478.9797 1493.3474 1505.8623 1520.8258 1522.0670 1525.3681 1655.4076 1663.6856 1666.3358 1681.9293 1682.4429 1684.2239 1709.7133 2954.0079 2969.1366 3008.9984 3014.6048 3189.8004 3197.7053 3202.7082 3202.8136 3210.1564 3210.6794 3211.2944 3216.0993 3217.0241 3217.3494 3222.2046 3223.2931 3227.7615 3228.1988 3228.4253
redmass: 4.7186 5.1475 4.9923 4.1555 4.8188 4.4129 5.9628 5.2949 4.8742 3.9242 5.2577 5.0782 5.1748 4.6759 4.6229 5.0692 4.6779 2.6573 7.0896 5.7498 5.3448 5.8950 2.8339 3.0222 5.0251 2.9404 3.9677 5.4227 4.1993 4.1219 7.2654 5.7455 6.3232 6.3659 6.3799 6.0763 4.1304 5.4668 1.6774 5.5274 1.6075 1.4902 5.3870 1.9498 1.9682 2.5902 1.2496 1.2500 1.2495 5.0600 2.2019 1.3772 1.9779 1.4187 1.3801 3.3864 6.0487 6.0290 1.6284 1.3885 1.3898 1.4106 1.7284 1.4046 1.3765 1.4570 2.0236 2.1235 1.6069 1.4988 1.4823 4.6299 1.3196 2.7023 1.8800 2.1579 1.1935 1.7834 1.1020 1.1087 1.3260 1.2155 1.1870 2.4445 4.0583 10.1134 1.5784 1.4227 1.4157 1.4071 1.6443 5.9797 6.4471 6.6647 2.3385 2.0542 1.2300 2.3287 1.9961 1.8767 2.3923 2.3859 2.5507 6.6610 6.3299 6.3761 6.3352 6.3248 6.4267 10.4651 1.0608 1.0620 1.1022 1.1052 1.0863 1.0914 1.0869 1.0869 1.0898 1.0900 1.0951 1.0938 1.0941 1.0974 1.0974 1.0970 1.1014 1.1012 1.0946
irintensity: 1.1439 2.6737 0.6759 0.8172 2.0828 1.2331 3.4941 2.0367 1.2245 0.4236 0.0426 0.2907 19.4411 2.7925 11.7849 11.9184 1.8964 40.3393 10.0144 2.9759 2.3472 9.7267 0.6168 3.9840 13.3870 1.6539 9.7454 36.5090 7.6684 79.5038 191.6228 161.7255 0.4453 0.3437 1.7262 9.7172 21.0827 27.8257 32.9009 32.9491 127.3341 74.4969 104.2472 0.0552 3.5733 20.7543 0.0591 0.9505 0.7038 18.6372 2.3350 0.0980 9.9674 0.1615 1.1588 2.6190 1.6390 2.0187 19.6525 0.3465 0.3086 12.7819 47.5278 2.1239 0.2965 7.3258 9.4013 9.5696 32.3373 8.9921 33.3921 140.2189 34.8254 6.7600 127.9133 159.6972 1.8671 145.5605 3.2870 5.9391 12.5899 4.3485 3.2512 7.7816 111.6262 361.3296 31.1803 8.4523 5.9830 1.3298 156.9476 0.8310 3.3620 0.1167 2.1677 7.5508 11.0709 54.7804 106.8009 72.1952 4.1975 2.4310 45.5981 134.9536 0.0081 0.9571 6.1812 4.9681 45.1722 547.3352 220.1613 153.9766 84.4741 81.5403 2.2839 17.4209 0.0626 0.3067 0.9046 6.7588 16.5351 3.9990 4.9696 30.8295 10.0368 14.6162 20.3334 11.7618 8.7872
temp: 298.150 k
press: 1.00000 atm
elementType: 6 6 6 1 1 1 1 7 6 8 6 6 6 6 1 6 1 6 1 1 1 15 8 6 6 6 6 1 6 1 6 1 1 1 6 6 6 6 1 6 1 6 1 1 1
symmnumber: 1
zpe: 939214.2 jmol-1
zpe.correction: 0.357728 hartree
zpe.thermalcorrener: 0.380013 hartree
zpe.thermalcorrenthalpy: 0.380957 hartree
zpe.thermalcorrgfe: 0.302064 hartree
zpe.sumelectzpe: -1394.886268 hartree
zpe.sumelectthermal: -1394.863982 hartree
zpe.sumelectthermalent: -1394.863038 hartree
zpe.sumelectthermalfe: -1394.941931 hartree
dipole: -14.3978 -11.9868 -3.0758
dipole: 18.9852
quadrupole: -204.2011 -183.8645 -171.5330
quadrupole: -42.9605 6.8506 2.3177
quadrupole: -17.6682 2.6684 14.9998 -42.9605 6.8506 2.3177
hfenergy: -1395.2439958 hartree
pointgroup: C01 [X(C22H19N1O2P1)]
dipole: -5.9807056 -0.3458482 -0.161586 debye
polarizability: 318.2039195|15.8482582|413.1665429|-65.3064555|-13.3609416|338.7015066 unknown
InChI: InChI=1/C22H19NO2P/c24-22(18-10-4-1-5-11-18)19-16-23(17-19)26(25,20-12-6-2-7-13-20)21-14-8-3-9-15-21/h1-15H,16-17H2
charge -1 multiplicity 1
45 atoms
C  1.34532392 1.30200011 0.31147177
C  1.87893664 2.71237327 0.34558117
C  0.53758475 3.22887355 0.82874181
H  1.37925942 0.77438887 -0.66218579
H  1.71962298 0.59918389 1.08483322
H  0.0195832 3.99065919 0.21256391
H  0.47488106 3.56268969 1.88630272
N  0.00328781 1.85719444 0.63398728
C  3.00763343 3.21151444 -0.27327369
O  3.89159912 2.49960918 -0.835362
C  3.18822378 4.72097757 -0.32895644
C  2.5461056 5.63314635 0.52303572
C  4.06954883 5.23249957 -1.29260918
C  2.75952808 7.00710756 0.39691336
H  1.88885883 5.27238422 1.31627926
C  4.28169111 6.60302557 -1.42675305
H  4.58684318 4.50809629 -1.92599632
C  3.62296428 7.50016791 -0.5824926
H  2.25240443 7.69760539 1.07643361
H  4.96823719 6.97686657 -2.1917059
H  3.78878959 8.57614416 -0.68099629
P  -1.08963295 1.12911253 1.65657523
O  -0.73913959 0.88756173 3.10069062
C  -2.54953211 2.20757169 1.5129155
C  -2.94248598 2.78114175 0.2966045
C  -3.29450862 2.45996693 2.66964304
C  -4.07465862 3.59193354 0.24043553
H  -2.35382698 2.60087251 -0.60603997
C  -4.42748078 3.2714625 2.61136366
H  -2.97057246 2.01864018 3.61515167
C  -4.81840942 3.83588928 1.39699689
H  -4.37596032 4.03993954 -0.70936702
H  -5.00508102 3.46652094 3.51809997
H  -5.70495293 4.47318674 1.35105084
C  -1.45346045 -0.43547139 0.80092619
C  -1.55624416 -0.52243734 -0.59362263
C  -1.63682422 -1.58179143 1.58133649
C  -1.84863654 -1.74422621 -1.19708075
H  -1.394972 0.3661847 -1.20851111
C  -1.93009718 -2.80341408 0.97545643
H  -1.53957105 -1.5055247 2.66684553
C  -2.03770772 -2.88424653 -0.41306696
H  -1.92401246 -1.80891197 -2.28507603
H  -2.07101154 -3.69610259 1.58951688
H  -2.26505431 -3.84148901 -0.88871761
