program: Gaussian 16
title: preassociation
version: ES64L-G16RevC.02
method: UwB97XD
basis: def2SVP
operation: Freq
keyword: #P
keyword: Geom=AllCheck
keyword: Guess=TCheck
keyword: SCRF=Check
keyword: Test
keyword: GenChk
keyword: UwB97XD/def2SVP
keyword: Freq
converged: YES YES YES YES
polarizability: 6.79233692e+02 2.14184104e+01 6.28870320e+02 1.80551902e+01 2.54628579e+01 5.32257484e+02
1716.lowfreq: -1002.3324 -7.3015 -0.0015 -0.0014 -0.0008 9.5028 10.5607 21.7985 26.3967
frequency: -1002.3324 21.2072 26.1232 27.9953 31.6419 37.9993 45.0245 47.1429 51.2145 53.7202 56.4454 58.9127 63.4422 70.1328 83.6370 89.7678 94.6092 96.0219 133.4085 144.5235 146.6175 176.8181 189.8647 205.7312 208.1733 225.5281 232.4762 241.5342 263.6833 270.3950 274.9388 304.3468 309.4541 318.0659 343.2308 362.2166 402.0336 408.3159 411.3781 413.1893 415.7404 417.4368 423.1474 424.0202 430.7928 470.4798 476.7192 481.4669 495.5054 507.6171 519.5987 537.8694 547.7954 560.7721 626.7729 628.3836 629.7402 630.5991 630.6554 632.3016 634.2353 680.9238 697.9343 710.2768 713.0226 719.7466 721.6806 722.3100 722.8084 728.4780 729.7430 736.8671 753.7635 771.3631 777.1633 781.8883 783.4391 787.0878 808.3797 835.5052 853.2066 876.7485 876.9168 884.2311 886.3350 886.8376 900.1283 945.1582 967.2450 969.3159 974.2504 978.8184 983.3781 988.8198 998.9893 1013.0601 1016.2031 1018.9426 1019.2163 1020.9507 1022.8004 1022.9716 1030.5798 1031.4264 1031.6428 1032.9722 1043.1315 1052.2533 1053.3432 1054.3756 1055.6037 1055.7041 1056.4688 1056.9686 1057.5051 1058.8165 1062.0734 1063.5413 1066.0266 1091.9206 1104.3572 1108.4216 1111.8139 1114.7384 1118.3314 1121.5478 1122.1358 1136.3337 1160.1440 1162.6831 1168.0802 1170.5121 1171.4727 1172.0654 1172.6240 1173.5851 1190.8219 1191.4710 1194.2580 1199.7264 1206.4544 1210.6387 1218.4253 1324.5493 1327.5806 1328.9686 1329.2323 1336.9181 1340.8585 1364.6710 1366.9244 1367.6906 1370.1638 1372.9447 1375.8876 1382.1420 1439.0541 1476.5900 1477.8282 1479.7843 1480.1272 1485.5455 1489.1362 1520.2310 1524.9223 1525.7778 1528.5354 1533.5682 1537.9174 1585.5122 1659.7813 1663.3307 1663.8499 1664.5358 1665.0506 1665.9711 1673.8890 1677.2261 1682.0078 1682.7822 1686.5499 1690.0417 1699.7430 3204.2878 3204.4994 3206.0238 3211.3294 3212.0677 3212.0738 3212.5913 3214.2307 3215.0575 3217.7235 3218.3845 3220.0523 3221.0606 3221.2098 3221.8384 3226.0357 3226.1944 3226.2197 3227.1055 3227.5409 3228.9939 3232.8048 3232.9520 3233.1963 3233.6591 3233.9349 3234.2620 3237.4682 3238.4789 3242.3818
redmass: 1.1690 5.6576 3.8694 5.3478 5.3903 5.6014 5.0723 4.3786 5.0365 5.2183 4.1531 4.8886 4.4779 4.1165 5.6751 5.6287 4.0870 4.0128 5.7112 5.7464 6.6507 6.1023 5.3651 5.5026 5.2391 5.1876 5.5742 4.7652 5.2916 5.3238 4.7256 5.3320 7.6518 7.3852 8.7457 8.1501 5.6019 6.3397 2.9004 2.9282 2.9578 3.0578 2.9863 5.5013 3.0477 4.6970 4.3879 6.8550 3.9147 5.4386 4.2638 4.9064 6.9694 6.0771 6.4262 6.3940 6.4554 6.4010 6.3841 6.4081 6.6015 5.7374 6.6678 2.5466 5.4250 2.2041 1.8504 1.7442 1.7274 3.9415 1.8336 1.8874 6.3533 2.1201 1.8116 1.8395 1.7790 1.7747 2.7188 4.2515 5.5397 1.2580 1.2523 1.2447 1.2474 1.2473 1.2487 13.5031 1.4492 1.8649 1.3717 1.3559 1.4320 1.3461 2.7345 6.2354 5.7145 5.7466 5.6142 5.9176 1.3979 5.1060 1.4074 1.3867 1.3771 1.3861 1.3668 1.3588 1.3810 1.5112 1.4877 2.6866 1.7999 2.1335 1.3984 2.0107 2.5217 1.9511 1.3520 2.6741 1.4734 1.9089 1.8068 1.6937 1.5589 1.5693 1.5515 3.0446 2.9163 3.0011 1.1173 1.0818 1.0913 1.0823 1.0806 1.0877 1.1733 1.1456 1.1437 1.1170 1.1820 1.1695 2.5340 1.4469 1.4510 1.5231 1.6573 1.7092 1.6685 3.4588 4.5709 3.1485 4.8800 2.9213 3.2283 6.1757 1.1689 2.3478 2.3844 2.3864 2.3570 2.4919 2.4782 2.2017 2.3174 2.3211 2.1810 2.3650 2.4117 3.4022 5.6233 6.0449 6.0542 6.1677 6.2204 5.6470 6.1522 5.9378 6.1743 6.1451 5.9603 6.0345 1.5045 1.0901 1.0901 1.0890 1.0900 1.0895 1.0897 1.0880 1.0877 1.0882 1.0935 1.0916 1.0927 1.0919 1.0922 1.0911 1.0939 1.0962 1.0964 1.0942 1.0975 1.0968 1.0976 1.1013 1.1015 1.0986 1.0996 1.0999 1.1016 1.1013 1.0970
irintensity: 5982.1988 0.4908 0.1853 0.3614 0.0251 0.6983 2.2293 0.0334 0.0451 0.3599 0.2217 0.0764 0.1044 0.4164 25.4663 1.2690 0.5292 4.4268 6.8264 36.1997 81.4717 8.4198 3.7151 5.8907 2.1315 22.0633 29.7259 3.6077 40.4153 19.3381 16.1065 5.7315 18.2096 63.0099 101.4290 277.9686 48.8185 114.2384 4.0681 7.4865 6.5880 10.6554 12.4940 40.7049 10.5762 9.5046 5.2161 196.0060 36.9604 17.4895 73.0577 88.5436 314.0956 77.2167 0.5822 1.9156 4.8933 0.3160 1.9404 0.1462 26.6607 51.4188 31.3004 14.3230 5.9209 82.2954 80.9535 67.0111 40.6274 54.5443 27.8433 88.8644 120.3597 13.3825 40.5955 22.4735 25.9271 39.5631 105.1943 189.3629 84.6703 3.8340 0.6607 2.3256 4.8916 0.6604 1.5167 886.8823 10.3798 40.8343 2.8572 7.5359 7.5481 0.3790 16.3578 1.4230 5.6511 0.7740 6.6422 22.0134 0.0218 7.2092 1.8672 0.5703 3.5922 0.8550 2.3187 0.0905 0.1837 0.9587 2.4325 0.0918 3.5499 4.6460 0.5819 6.7742 2.4049 9.3992 5.1181 315.9101 8.8916 53.0332 26.5010 58.6456 58.8313 16.8094 52.3231 111.3290 197.0717 47.0907 3.3389 0.4470 1.8830 0.5659 1.8206 2.2865 7.3121 47.2940 8.8587 0.3574 0.4344 24.8202 8.3595 6.2598 2.8729 27.1255 9.3438 18.4083 24.4042 6.4985 74.9620 263.9792 8.7571 159.2568 10.3152 44.7816 417.2122 36.4912 54.8984 39.1359 26.5713 4.8890 56.9638 6.6094 1.9177 1.4123 15.1514 27.5252 120.8162 624.6686 4.5811 15.2421 10.9377 2.6181 1.3035 8.4258 0.4101 8.2767 7.3835 17.6671 141.1819 15.9377 364.5917 0.2455 0.3773 0.1124 0.9835 0.7122 0.2277 0.4545 0.7205 0.0284 0.2450 1.5084 2.6586 5.7444 3.4475 1.2784 4.8132 6.8972 8.9373 2.0226 6.7706 3.8085 3.6341 13.3351 8.8119 5.1457 3.7393 4.7021 7.1566 5.4382 24.0399
temp: 298.150 k
press: 1.00000 atm
elementType: 6 6 6 6 1 6 1 6 1 1 1 6 6 6 6 1 6 1 6 1 1 1 15 7 6 6 6 6 6 1 6 1 6 1 1 1 6 6 6 6 1 6 1 6 1 1 1 15 8 6 6 6 6 1 6 1 6 1 1 1 6 6 6 6 1 6 1 6 1 1 1 8 1
symmnumber: 1
zpe: 1532093.3 jmol-1
zpe.correction: 0.583544 hartree
zpe.thermalcorrener: 0.619083 hartree
zpe.thermalcorrenthalpy: 0.620027 hartree
zpe.thermalcorrgfe: 0.512510 hartree
zpe.sumelectzpe: -2313.914163 hartree
zpe.sumelectthermal: -2313.878624 hartree
zpe.sumelectthermalent: -2313.877680 hartree
zpe.sumelectthermalfe: -2313.985196 hartree
dipole: -4.0416 -1.3559 -2.9895
dipole: 5.2067
quadrupole: -187.5207 -205.9970 -202.9820
quadrupole: 1.2014 6.3927 10.3207
quadrupole: 11.3126 -7.1638 -4.1488 1.2014 6.3927 10.3207
hfenergy: -2314.4977068 hartree
pointgroup: C01 [X(C37H31N1O2P2)]
dipole: -1.5080688 -0.6121118 -1.2215623 debye
polarizability: 679.2336921|21.4184104|628.8703202|18.0551902|25.4628579|532.2574839 unknown
InChI: InChI=1/C37H31NO2P2/c39-42(35-27-15-5-16-28-35,36-29-17-6-18-30-36)40-43-38(37(31-19-7-1-8-20-31)32-21-9-2-10-22-32)41(33-23-11-3-12-24-33)34-25-13-4-14-26-34/h1-30H
charge 1 multiplicity 2
73 atoms
C  2.55850497 -0.6662938 -1.16444267
C  3.33146443 -1.69458954 -1.72533265
C  3.13080575 0.59723374 -0.95489984
C  4.65714253 -1.45683831 -2.08041722
H  2.90224898 -2.68538892 -1.88951814
C  4.45165659 0.82918554 -1.32804854
H  2.55757745 1.40549148 -0.49903537
C  5.21724991 -0.19484174 -1.88748203
H  5.25188958 -2.26380861 -2.51312345
H  4.88641494 1.81888319 -1.1736558
H  6.25533615 -0.00829517 -2.17139456
C  0.29746823 -2.18722453 -2.0403891
C  -0.16178877 -3.46894214 -1.73339854
C  0.32639451 -1.74280132 -3.37010939
C  -0.6091695 -4.30681331 -2.75554045
H  -0.18381062 -3.81058358 -0.69587525
C  -0.12483098 -2.58319844 -4.38354954
H  0.695856 -0.74320253 -3.61379082
C  -0.59445941 -3.86274983 -4.07642589
H  -0.97431204 -5.30762695 -2.51568271
H  -0.10804229 -2.23842584 -5.41975973
H  -0.94913118 -4.51758343 -4.87557632
P  0.8676155 -1.08002454 -0.67443465
N  -0.09176537 0.34455558 -0.92384226
C  -1.36940859 0.39440963 -1.19893565
C  -2.23722302 -0.79989911 -1.13974156
C  -3.02604475 -1.17185732 -2.23537828
C  -2.27845457 -1.54622089 0.04660914
C  -3.81687688 -2.31358479 -2.15555426
H  -2.9963777 -0.58281305 -3.1542919
C  -3.10320438 -2.66408349 0.13046729
H  -1.68661636 -1.2390807 0.91245926
C  -3.85996599 -3.0558739 -0.97332277
H  -4.40910184 -2.62287015 -3.01901489
H  -3.14789827 -3.23310067 1.06107974
H  -4.49344761 -3.94350384 -0.91250055
C  -1.95660994 1.7052792 -1.49264868
C  -3.31865241 1.94176594 -1.23428661
C  -1.15053948 2.74670141 -1.98721157
C  -3.8563895 3.20559311 -1.4488498
H  -3.94665048 1.14277064 -0.83636062
C  -1.69810539 4.00382624 -2.20899967
H  -0.10035815 2.5597092 -2.22078387
C  -3.04807138 4.2349603 -1.93458914
H  -4.91044094 3.39060146 -1.2334887
H  -1.07262167 4.80739788 -2.60219872
H  -3.47482797 5.22584414 -2.10555016
P  0.76608086 0.92309321 1.83098387
O  1.17092438 -0.47736625 1.24828439
C  1.97864713 1.35733537 3.08250582
C  1.70484632 2.38716179 3.99182349
C  3.2087973 0.69092484 3.11770495
C  2.66640112 2.75105987 4.93115262
H  0.74135657 2.90342601 3.96986418
C  4.16522215 1.05977954 4.06211647
H  3.41041048 -0.11667667 2.41071307
C  3.89453789 2.0876372 4.96574952
H  2.45577817 3.55335476 5.64143765
H  5.12482342 0.53939291 4.09399508
H  4.64536927 2.37295225 5.70618953
C  -0.87335461 0.79304942 2.5689717
C  -1.89695328 1.63901615 2.12923675
C  -1.14690841 -0.22218015 3.49643385
C  -3.19490185 1.46385266 2.60916019
H  -1.67760017 2.423951 1.40197157
C  -2.44377946 -0.39040287 3.9731642
H  -0.34863985 -0.88672988 3.83756332
C  -3.46751323 0.44911435 3.52559357
H  -3.99517082 2.12130043 2.26229954
H  -2.6604224 -1.18220802 4.69342411
H  -4.48516364 0.31059499 3.89790502
O  0.71337595 1.99282892 0.70375966
H  0.33867865 1.30498991 -0.30991722
