program: Gaussian 16
title: Reactants
version: ES64L-G16RevC.02
method: UwB97XD
basis: def2SVP
operation: Freq
keyword: #P
keyword: Geom=AllCheck
keyword: Guess=TCheck
keyword: SCRF=Check
keyword: GenChk
keyword: UwB97XD/def2SVP
keyword: Freq
converged: YES YES YES YES
polarizability: 3.19833851e+02 -8.22795322e+01 3.65708811e+02 6.77512082e+00 2.65113402e+01 3.57687597e+02
1716.lowfreq: -12.7194 -5.4798 -4.3112 -0.0017 -0.0013 0.0002 14.2168 29.9051 36.1791
frequency: 14.0137 29.7992 36.1313 40.0896 44.5490 58.8441 62.1697 64.8020 74.5691 91.4578 121.6903 129.4022 139.9942 173.0955 178.0504 182.6640 249.1167 250.4463 271.4079 290.1473 334.5513 361.5775 381.7387 417.1382 419.5995 420.5838 437.4307 458.5749 481.3440 489.0274 525.4045 535.9017 602.0843 630.0275 630.7459 631.6876 701.3155 705.4466 718.1894 724.3317 730.6618 733.5969 734.4140 776.7814 785.1084 814.7360 838.3697 878.0926 884.2645 885.8416 892.4302 893.8097 966.3297 979.1651 983.6520 996.9633 1015.1181 1017.1328 1020.6921 1027.2695 1028.1900 1032.8480 1035.3613 1048.6030 1051.9250 1054.6705 1058.0119 1059.1160 1061.0640 1073.7245 1100.6267 1105.9874 1112.6146 1114.8548 1122.8767 1129.4220 1131.1401 1165.1783 1165.9494 1168.1300 1169.2648 1180.7597 1188.4142 1191.3499 1197.4072 1211.4116 1268.2294 1308.9393 1318.8274 1326.6122 1336.6874 1362.2342 1365.1553 1378.7828 1436.4688 1473.5660 1476.1262 1477.7753 1491.1103 1516.9833 1520.8012 1535.7231 1544.9629 1657.8538 1660.1112 1669.5474 1674.2294 1675.7922 1690.6433 1806.0564 3108.8497 3115.1271 3205.1340 3206.1539 3208.6255 3212.6094 3213.1602 3217.8638 3218.7108 3219.2532 3224.3440 3225.3674 3225.6880 3229.7528 3230.4342 3233.4290 3234.7455 3239.2207 3243.2398
redmass: 5.6768 5.6296 6.2703 5.3228 4.4538 6.6978 5.7660 4.7516 4.8209 4.5484 4.1124 4.8734 5.0282 5.4127 5.7475 4.8784 5.2927 4.7923 5.5351 7.3867 4.8324 7.7102 7.4371 2.8633 2.8950 2.8625 4.9092 3.5454 6.0942 5.0678 3.9249 2.6514 4.6116 6.4012 6.3913 6.4042 6.4172 5.5273 2.3750 1.7836 2.0321 2.1767 3.3418 1.6819 1.7946 2.6813 3.3745 3.4021 1.2599 1.2609 2.2214 1.2498 1.3695 1.3547 1.5191 2.9045 5.8982 6.0553 3.6735 1.4222 1.9377 1.3956 1.3816 1.3419 1.7386 1.3844 1.8662 2.1740 1.8672 1.2307 1.4846 1.7031 1.4341 2.4492 1.8366 1.4010 3.1149 1.2851 1.1018 1.0846 1.0969 6.3320 1.2064 1.1192 1.1370 1.6951 3.7474 4.1336 1.4892 1.5152 1.3965 4.7165 4.1841 6.4486 1.8674 2.3014 1.7559 1.4952 2.4695 2.2873 2.2416 2.1788 2.5189 6.1294 6.1448 6.3581 6.1276 6.1529 6.2673 12.8025 1.0592 1.0586 1.0871 1.0870 1.0879 1.0905 1.0899 1.0932 1.0914 1.0947 1.0973 1.0956 1.0971 1.1008 1.1012 1.0988 1.1158 1.0982 1.1172
irintensity: 0.3347 0.9561 2.2895 1.4191 0.4132 2.7400 1.1046 1.3011 0.1809 2.1619 3.2610 2.2208 3.9210 3.6839 9.7328 1.8954 4.3020 2.4385 4.7795 10.4483 0.8875 14.7734 0.8715 0.0728 0.3145 0.6723 16.9357 1.0596 68.9273 41.6848 52.2796 6.1099 23.1498 0.3086 0.4181 1.2359 1.0784 10.0388 9.3970 82.0357 87.1813 146.9904 13.7881 30.4702 48.2848 27.0582 6.1269 6.8155 0.9816 1.1171 6.0424 1.3454 2.3114 0.6624 18.5387 124.7421 2.8098 0.8527 1.2210 2.9114 19.2606 1.4524 2.0031 0.1095 5.0879 0.9132 6.7727 1.3842 2.0584 3.3821 13.4368 27.9564 15.0820 1.6219 2.8981 3.4825 77.2381 6.1605 1.3443 0.5088 3.3066 149.4232 9.2284 23.3478 4.2665 2.6961 195.3335 74.7063 4.2691 4.3444 0.4902 3.1810 1.4083 13.0534 167.8282 21.4405 28.9260 10.1629 35.7533 6.4002 10.6533 6.2781 70.7391 1.3228 0.4330 14.0567 0.1322 5.1039 55.1591 333.8117 37.0321 17.9266 0.6345 1.4883 0.2037 7.8462 0.2767 1.3487 5.0701 12.1489 8.8202 6.1400 0.1477 34.3240 7.9251 10.8140 2.6779 1.5064 1.1289
temp: 298.150 k
press: 1.00000 atm
elementType: 6 6 6 1 1 1 1 7 6 8 6 6 6 6 1 6 1 6 1 1 1 15 8 6 6 6 6 1 6 1 6 1 1 1 6 6 6 6 1 6 1 6 1 1 1
symmnumber: 1
zpe: 938514.7 jmol-1
zpe.correction: 0.357461 hartree
zpe.thermalcorrener: 0.380619 hartree
zpe.thermalcorrenthalpy: 0.381563 hartree
zpe.thermalcorrgfe: 0.300550 hartree
zpe.sumelectzpe: -1394.693480 hartree
zpe.sumelectthermal: -1394.670322 hartree
zpe.sumelectthermalent: -1394.669378 hartree
zpe.sumelectthermalfe: -1394.750391 hartree
dipole: 3.5892 -1.8402 -6.9238
dipole: 8.0129
quadrupole: -134.4002 -146.3084 -170.9586
quadrupole: -10.0911 4.3224 13.9629
quadrupole: 16.1555 4.2473 -20.4029 -10.0911 4.3224 13.9629
hfenergy: -1395.0509409 hartree
pointgroup: C01 [X(C22H19N1O2P1)]
dipole: 1.412094 -0.723991 -2.7240208 debye
polarizability: 319.8338515|-82.2795322|365.7088114|6.7751208|26.5113402|357.6875969 unknown
InChI: InChI=1/C12H10OP.C10H9NO/c13-14(11-7-3-1-4-8-11)12-9-5-2-6-10-12;12-9(10-6-11(10)7-10)8-4-2-1-3-5-8/h1-10H;1-5H,6-7H2
charge 0 multiplicity 2
45 atoms
C  2.55980735 2.26637226 0.4791749
C  2.22103615 1.190901 -0.47969402
C  2.68590235 0.09021171 0.38565621
H  3.60448552 2.34987646 0.80667471
H  1.98866647 3.19748995 0.43517895
H  3.73057995 0.09264343 0.7242158
H  2.220715 -0.89435717 0.27880472
N  1.78440494 1.11513239 0.93139105
C  1.2232347 1.28032901 -1.58754258
O  0.46422918 2.22945129 -1.62093517
C  1.17157105 0.19965526 -2.61232212
C  2.19598489 -0.74329581 -2.76690175
C  0.03891696 0.13208413 -3.43636931
C  2.07976096 -1.74901966 -3.72470167
H  3.09287661 -0.69343672 -2.14798738
C  -0.07933023 -0.87776732 -4.38471218
H  -0.75024563 0.87568754 -3.30902477
C  0.94110195 -1.82204825 -4.52702596
H  2.8817835 -2.48061965 -3.84350154
H  -0.96906359 -0.93289648 -5.01566571
H  0.84837795 -2.61698638 -5.27080248
P  -0.62402295 -0.1159522 2.76430239
O  -0.95940497 -0.69178358 4.12648585
C  -1.89294016 1.01673907 2.12981088
C  -1.63290331 1.88346291 1.05885878
C  -3.13214887 1.06589943 2.7834305
C  -2.62373664 2.75905432 0.61869152
H  -0.65520631 1.87945256 0.57224255
C  -4.11512195 1.94973732 2.34199502
H  -3.3208727 0.40796829 3.63494896
C  -3.86461574 2.79178143 1.25711407
H  -2.41844885 3.42454079 -0.22283836
H  -5.0828217 1.98053096 2.84816112
H  -4.63801032 3.48238995 0.91254509
C  -0.30027997 -1.41330461 1.5291828
C  -0.567124 -1.27147744 0.16128751
C  0.30434595 -2.58871483 1.99777371
C  -0.23498316 -2.29668538 -0.72307159
H  -1.03753384 -0.36421847 -0.2240855
C  0.64274798 -3.60574605 1.10772141
H  0.50623401 -2.70401954 3.06554652
C  0.37553555 -3.46039329 -0.25462743
H  -0.44937485 -2.18051147 -1.78780039
H  1.11488893 -4.51747679 1.48099889
H  0.64083785 -4.25683639 -0.95374399
