program: Gaussian 16
title: Reactants
version: ES64L-G16RevC.02
method: UwB97XD
basis: def2SVP
operation: Freq
keyword: #P
keyword: Geom=AllCheck
keyword: Guess=TCheck
keyword: SCRF=Check
keyword: GenChk
keyword: UwB97XD/def2SVP
keyword: Freq
converged: YES YES YES YES
polarizability: 2.94832119e+02 -4.63684164e+01 3.64548371e+02 -2.15924781e+01 8.17629066e+00 3.66350531e+02
1716.lowfreq: -4.1376 -0.0014 -0.0011 0.0007 6.2586 8.4805 15.6842 24.3659 25.9761
frequency: 14.9240 24.3406 25.9326 32.3173 38.9682 49.9310 65.8468 86.2254 110.0116 119.3346 152.3459 163.8376 180.5446 198.6260 219.1940 241.5600 249.2951 287.9703 306.6496 325.2585 353.5273 387.2661 415.9430 418.9589 422.6330 423.5997 458.3098 460.3816 473.7137 529.3550 558.3405 587.9413 629.4111 631.4102 632.7374 640.0766 687.0985 708.0311 725.0639 725.4841 726.5619 730.7038 746.1547 782.4105 791.2535 815.8945 819.2216 883.7264 886.3327 890.9481 897.5864 960.1799 972.4614 978.4440 978.9784 1008.0531 1018.7604 1019.3257 1020.5825 1029.4883 1029.6520 1033.1081 1050.2255 1053.4507 1054.0983 1056.7029 1057.0887 1058.5437 1099.4942 1103.1417 1104.7125 1109.9984 1119.2646 1133.6385 1147.3612 1150.5625 1164.4735 1167.8011 1168.1795 1170.4581 1185.3326 1187.6125 1189.6164 1199.1910 1236.8208 1254.7630 1299.4195 1319.4687 1323.7311 1325.1740 1334.3528 1364.2322 1368.5102 1372.3588 1424.8330 1446.3354 1477.3476 1478.7399 1480.0699 1506.1702 1523.1516 1524.6961 1542.5695 1642.1984 1663.9700 1666.8856 1678.9376 1682.4604 1683.1418 1692.2187 3020.7894 3031.5148 3090.1591 3098.7208 3204.8516 3206.2270 3206.6235 3211.7500 3214.0785 3215.6694 3217.7208 3220.3432 3223.9960 3224.3351 3226.1183 3229.3618 3231.2228 3231.6538 3243.4809
redmass: 5.4224 4.5089 4.6458 4.6823 5.0870 5.5784 4.4846 5.2093 3.4582 3.8400 6.5363 5.3727 4.5867 5.6873 5.0202 5.1070 5.2790 2.3819 7.4966 5.9475 5.0793 6.0365 2.8178 3.8802 3.1053 3.3982 4.3145 3.9544 4.8089 4.3615 7.3483 5.6432 6.3225 6.4032 6.3954 6.3694 3.9434 6.1583 2.7277 1.6923 2.1775 1.6579 5.2322 1.9040 1.9003 1.7430 1.6067 1.2620 1.2484 1.2507 5.0257 3.4552 1.3705 1.5075 1.3888 2.0013 6.0321 5.9489 5.0576 1.4043 1.3906 1.3826 1.4332 1.4315 1.4251 2.0083 2.1159 1.8340 1.4796 1.4949 1.4415 2.4622 1.8061 2.5224 2.2980 2.8736 1.1098 1.0896 1.0903 1.3616 1.3255 1.1771 1.1426 1.9184 4.3343 5.7944 2.0490 1.4483 1.4311 1.7521 1.5060 5.3461 5.7089 6.4275 1.0732 1.1144 2.3533 2.8810 2.3767 4.3098 2.3533 2.3464 2.9939 9.8939 6.2747 6.3150 7.4264 6.2584 6.2545 6.3742 1.0594 1.0625 1.1049 1.1050 1.0871 1.0875 1.0871 1.0899 1.0900 1.0918 1.0939 1.0939 1.0974 1.0963 1.0973 1.1015 1.1014 1.0980 1.0949
irintensity: 0.6604 0.7615 1.2591 0.6051 0.3513 1.8037 0.2621 0.7840 2.5379 3.8128 5.4234 2.4164 12.1160 15.1628 4.4827 4.2288 6.6609 15.0007 9.3347 1.2039 8.1530 2.9581 0.1090 15.1668 2.6444 7.9884 15.8740 10.3140 10.6375 94.8601 158.3160 112.9554 20.1546 0.3252 0.6850 31.9198 36.3917 11.1889 49.7025 30.5865 95.6629 115.5052 108.7924 0.0472 5.2329 7.0219 10.2145 0.4538 0.0712 0.7513 32.7633 34.9218 0.0384 4.3915 0.2595 29.6593 1.6987 1.7193 0.1534 1.5645 0.1834 0.5785 4.2976 1.9479 0.7993 7.8876 6.4912 10.8290 2.1253 36.5660 25.1208 115.4375 88.6712 18.0461 303.3861 164.2896 4.7470 0.6485 0.5284 18.2082 36.7129 0.7231 1.1107 15.4690 196.6042 362.4650 9.3290 1.1705 5.5638 8.8304 8.1337 0.9828 3.1096 6.9490 18.1465 33.1355 2.6487 24.6923 58.6968 153.2211 3.7740 1.7441 32.0928 163.6206 0.0133 0.5584 34.1590 9.7802 7.3930 20.9990 27.6307 19.4319 7.2181 8.5084 0.0966 0.2982 0.1887 2.3128 4.7637 6.9048 3.3555 2.5897 6.9930 9.3122 12.7183 14.7300 11.7666 10.1383 3.5280
temp: 298.150 k
press: 1.00000 atm
elementType: 6 6 6 1 1 1 1 7 6 8 6 6 6 6 1 6 1 6 1 1 1 15 8 6 6 6 6 1 6 1 6 1 1 1 6 6 6 6 1 6 1 6 1 1 1
symmnumber: 1
zpe: 941307.6 jmol-1
zpe.correction: 0.358525 hartree
zpe.thermalcorrener: 0.380821 hartree
zpe.thermalcorrenthalpy: 0.381765 hartree
zpe.thermalcorrgfe: 0.302307 hartree
zpe.sumelectzpe: -1394.761320 hartree
zpe.sumelectthermal: -1394.739024 hartree
zpe.sumelectthermalent: -1394.738080 hartree
zpe.sumelectthermalfe: -1394.817538 hartree
dipole: -3.2721 -4.2174 -1.5937
dipole: 5.5707
quadrupole: -145.1478 -148.7280 -151.5033
quadrupole: -12.3071 -10.5828 12.1589
quadrupole: 3.3119 -0.2683 -3.0436 -12.3071 -10.5828 12.1589
hfenergy: -1395.1198447 hartree
pointgroup: C01 [X(C22H19N1O2P1)]
dipole: -1.2873393 -1.6592551 -0.6270219 debye
polarizability: 294.8321185|-46.3684164|364.5483708|-21.5924781|8.1762907|366.3505308 unknown
InChI: InChI=1/C22H19NO2P/c24-22(18-10-4-1-5-11-18)19-16-23(17-19)26(25,20-12-6-2-7-13-20)21-14-8-3-9-15-21/h1-15H,16-17H2
charge 0 multiplicity 2
45 atoms
C  0.19575447 1.70444453 -0.49853758
C  1.07930345 1.04632265 -1.50581977
C  0.82501308 -0.29658322 -0.89042773
H  0.73646586 2.34172506 0.22657983
H  -0.65509421 2.27928949 -0.90223749
H  1.69702193 -0.7309082 -0.36524975
H  0.39982146 -1.06662976 -1.55776873
N  -0.15628929 0.35501657 0.00655029
C  1.68648522 1.60987907 -2.67582629
O  1.51340433 2.81056115 -2.91024265
C  2.47886269 0.753832 -3.61796626
C  3.0258167 -0.48180908 -3.24810842
C  2.69106067 1.23268507 -4.91809638
C  3.76321031 -1.2279807 -4.166854
H  2.90525768 -0.86299358 -2.23317974
C  3.4190466 0.48323434 -5.83715769
H  2.27282036 2.2026048 -5.19451624
C  3.95608029 -0.75048213 -5.46288942
H  4.19231647 -2.18620063 -3.86556015
H  3.57101242 0.86217678 -6.85042961
H  4.530098 -1.33883663 -6.18268131
P  -0.26747533 -0.00733024 1.64550564
O  0.95539102 0.16872342 2.50086984
C  -1.6295952 1.06542939 2.18071651
C  -2.7969748 1.23454825 1.42414128
C  -1.48667689 1.73673878 3.39956624
C  -3.81349525 2.06513934 1.8905492
H  -2.9090338 0.72156188 0.46595819
C  -2.50670974 2.56719097 3.86341341
H  -0.56802501 1.60514074 3.97598197
C  -3.66914459 2.73020925 3.11019862
H  -4.72218914 2.19732484 1.29890454
H  -2.39151063 3.09060435 4.81529977
H  -4.46784414 3.38157011 3.47310833
C  -0.83063453 -1.73245275 1.62219311
C  -1.77662069 -2.20342767 0.7019845
C  -0.28917382 -2.60548291 2.57197576
C  -2.18045057 -3.53636373 0.74018341
H  -2.19113773 -1.52817625 -0.05019401
C  -0.69635525 -3.93879736 2.60771228
H  0.45625674 -2.23081623 3.27722844
C  -1.64210096 -4.40319798 1.69368254
H  -2.91647929 -3.90255016 0.02086766
H  -0.27152996 -4.61790497 3.35047392
H  -1.9605329 -5.44802764 1.72121093
