program: Gaussian 16
title: Reactants
version: ES64L-G16RevC.02
method: UwB97XD
basis: def2SVP
operation: Freq
keyword: #P
keyword: Geom=AllCheck
keyword: Guess=TCheck
keyword: SCRF=Check
keyword: GenChk
keyword: UwB97XD/def2SVP
keyword: Freq
converged: YES YES YES YES
polarizability: 3.32715265e+02 -4.94310790e+01 3.87224549e+02 -5.09101523e+01 1.28695609e+01 4.59035714e+02
1716.lowfreq: -586.9707 -11.5493 -0.0014 -0.0011 -0.0010 4.3545 6.4146 18.4412 26.9981
frequency: -586.9707 18.1750 26.4385 38.2810 42.7698 53.9241 65.7407 78.3757 88.0902 119.4062 125.6509 167.1277 179.4504 182.4135 204.0013 237.4484 246.5921 249.5875 270.5533 306.7119 312.6938 353.0502 364.9290 419.1265 421.4588 425.7039 429.5062 438.4662 473.3215 476.7194 496.8300 528.0057 558.9248 610.8964 631.2848 632.2080 632.6051 702.1770 707.8079 724.0165 727.6749 732.7413 734.9983 737.3087 775.1782 787.0170 824.1646 839.9747 885.3046 886.5692 891.3159 927.1803 968.9992 978.2276 979.7415 1005.1280 1016.9490 1017.7406 1021.2556 1029.0011 1031.0164 1034.1985 1045.2206 1050.0452 1051.5522 1052.3583 1057.9279 1059.3899 1063.9751 1086.7518 1104.8206 1106.6337 1107.7387 1111.2690 1124.0662 1133.9822 1165.4237 1167.1793 1168.3390 1169.0250 1188.1672 1191.2147 1192.3466 1201.5171 1204.9676 1222.1842 1260.2634 1297.4588 1320.6113 1332.0381 1334.8497 1363.7947 1367.7781 1374.2885 1410.4423 1474.9014 1477.9992 1480.9836 1489.0491 1513.3068 1519.4661 1524.2579 1538.5916 1658.0276 1661.9749 1667.6417 1676.1861 1677.8688 1691.1396 1756.7563 3095.2332 3102.5083 3204.1948 3205.6500 3207.8722 3211.3227 3213.7103 3215.4205 3218.4983 3221.1018 3222.2066 3223.2990 3227.4114 3227.4846 3228.5299 3229.3476 3233.5400 3238.0014 3245.2174
redmass: 12.4096 5.9763 5.2686 5.5790 4.9552 4.1275 6.3896 4.4848 3.9476 6.5688 4.3598 7.2518 4.3937 5.2949 5.2652 4.7461 5.4366 5.2973 4.4964 7.7550 5.9820 5.4334 7.4655 4.2684 3.0376 3.1701 3.0080 5.6648 3.8844 3.8175 8.4233 3.7218 2.9761 3.7676 6.3915 6.3874 6.3558 6.3340 4.5990 2.8648 1.7675 1.7893 3.8600 2.0262 1.7399 1.8438 2.9813 2.5527 1.2444 1.2569 1.2404 2.2061 1.3647 1.3674 1.4505 2.5122 5.7642 5.6788 4.4056 1.3913 1.3889 1.3755 2.2055 1.3907 1.3537 1.3646 2.3164 2.5331 1.7802 1.1815 1.4968 2.2369 1.9818 1.4573 2.1044 3.1311 1.3156 1.0861 1.0872 1.0906 2.8977 1.5030 1.1342 1.3050 1.2123 1.5576 3.2824 4.1175 1.5257 1.5593 1.4313 4.2877 3.8113 5.5831 3.6592 2.3481 2.3624 1.1857 2.4628 1.3303 2.2703 2.2174 2.5413 6.0877 6.0582 6.3422 6.1634 6.1185 6.2618 12.5295 1.0611 1.0604 1.0873 1.0872 1.0874 1.0914 1.0913 1.0924 1.1115 1.0948 1.0951 1.0955 1.1082 1.1061 1.0998 1.0978 1.1006 1.0954 1.0931
irintensity: 1517.6859 0.7548 0.3933 1.4259 0.8352 1.4621 5.0110 0.4667 0.0931 3.6856 1.8775 9.7179 0.7211 0.7863 7.2398 5.7660 27.0012 10.5394 18.0128 9.0800 41.2911 14.2327 44.4446 19.0292 3.7936 6.2836 1.8196 59.3008 16.5035 28.0190 97.8505 112.1626 23.4272 2.0330 0.2224 0.4091 0.5153 4.3381 34.3331 5.2066 51.4176 195.9499 35.4474 32.6306 20.1337 25.7030 17.3917 53.9067 0.1241 1.4695 0.4153 17.9361 1.1758 8.5282 19.9408 155.8812 1.3251 1.3838 4.2247 1.2177 0.4059 0.8677 46.1562 2.1828 0.0045 0.7038 11.7189 4.2396 8.3794 7.0249 5.9955 54.6163 60.9808 19.9026 1.8239 65.6272 0.8316 0.0358 0.2276 1.2344 252.3579 47.5306 2.6432 27.2397 20.7248 30.6569 78.2704 85.2786 1.0185 2.9613 8.3403 2.3332 11.3404 11.2211 818.0329 11.0628 48.5317 5.6268 29.3320 86.8514 16.3365 8.5547 22.2496 1.1941 0.5387 18.3924 0.6416 9.2465 29.2818 556.0866 46.2604 27.3913 0.4036 0.4565 0.4057 5.2774 6.6481 1.9217 13.1803 3.0659 5.5362 5.1344 13.9745 13.6214 17.5257 9.5208 6.5623 0.9752 2.4603
temp: 298.150 k
press: 1.00000 atm
elementType: 6 6 6 1 1 1 1 7 6 8 6 6 6 6 1 6 1 6 1 1 1 15 8 6 6 6 6 1 6 1 6 1 1 1 6 6 6 6 1 6 1 6 1 1 1
symmnumber: 1
zpe: 937504.3 jmol-1
zpe.correction: 0.357077 hartree
zpe.thermalcorrener: 0.379177 hartree
zpe.thermalcorrenthalpy: 0.380121 hartree
zpe.thermalcorrgfe: 0.302896 hartree
zpe.sumelectzpe: -1394.679699 hartree
zpe.sumelectthermal: -1394.657598 hartree
zpe.sumelectthermalent: -1394.656654 hartree
zpe.sumelectthermalfe: -1394.733879 hartree
dipole: 2.5432 -1.7754 -4.5964
dipole: 5.5450
quadrupole: -143.1055 -151.8589 -182.1795
quadrupole: -2.6313 5.7676 8.9931
quadrupole: 15.9425 7.1890 -23.1315 -2.6313 5.7676 8.9931
hfenergy: -1395.0367753 hartree
pointgroup: C01 [X(C22H19N1O2P1)]
dipole: 1.0005687 -0.6984831 -1.8083574 debye
polarizability: 332.7152651|-49.431079|387.224549|-50.9101523|12.8695609|459.0357139 unknown
InChI: InChI=1/C12H10OP.C10H9NO/c13-14(11-7-3-1-4-8-11)12-9-5-2-6-10-12;12-9(10-6-11(10)7-10)8-4-2-1-3-5-8/h1-10H;1-5H,6-7H2
charge 0 multiplicity 2
45 atoms
C  0.94528184 3.59189802 2.31341379
C  1.31148097 2.76752776 1.12923482
C  1.74253979 1.60091164 1.94991323
H  1.75675236 3.88712366 2.99366048
H  0.14072618 4.32517398 2.19901353
H  2.61906378 1.7403474 2.59911038
H  1.63065428 0.59038427 1.54340982
N  0.49265469 2.20635462 2.39400445
C  0.58002001 2.8064104 -0.14935486
O  -0.18989937 3.7265166 -0.37909488
C  0.7369936 1.66777299 -1.10617283
C  1.90772599 0.90351922 -1.19639591
C  -0.34842333 1.36553742 -1.94067183
C  1.98380249 -0.15604201 -2.0991213
H  2.77422496 1.14525495 -0.57794641
C  -0.27604373 0.29772291 -2.82984805
H  -1.25287678 1.97342941 -1.87191667
C  0.89086403 -0.4661773 -2.90843154
H  2.90256522 -0.74222222 -2.17029572
H  -1.13144381 0.05897723 -3.46574706
H  0.94965547 -1.30369636 -3.60752611
P  -0.83845675 1.24777724 3.90612596
O  -0.71887625 0.90648293 5.3777173
C  -2.23509174 2.36717569 3.58888718
C  -2.50550301 2.94388121 2.3391168
C  -3.03526767 2.7039282 4.69030513
C  -3.57291439 3.82843037 2.19458553
H  -1.87869988 2.72018497 1.4747781
C  -4.10235261 3.58716481 4.53892727
H  -2.81116819 2.26649393 5.66575915
C  -4.37396336 4.14996156 3.2912299
H  -3.77405902 4.27368478 1.21752282
H  -4.72379575 3.83861344 5.40165807
H  -5.20866118 4.84512304 3.1738765
C  -0.99419564 -0.25215929 2.887636
C  -1.12360351 -0.23058828 1.49120332
C  -0.89394334 -1.48276258 3.54999378
C  -1.15255322 -1.42303747 0.77172203
H  -1.19020176 0.71621841 0.95352352
C  -0.92953908 -2.67406043 2.82638047
H  -0.78448142 -1.49532814 4.63682565
C  -1.05542412 -2.64669201 1.43721212
H  -1.24586297 -1.39270824 -0.31663334
H  -0.85393338 -3.62903652 3.35175135
H  -1.07536236 -3.58041818 0.87028806
