program: Orca
programVersion: 5.0.4
elementType: C C C C H C H C H H H C C C C H C H C H H H P N C C C C C H C H C H H H C C C C H C H C H H H P O C C C C H C H C H H H C C C C H C H C H H H O H
keywords: wB97X-D3 OPT FREQ VeryTightOpt PAL16
charge: 1
multiplicity: 2
frequency: 0.00 0.00 0.00 0.00 0.00 0.00 19.65 23.48 27.24 35.54 39.68 44.40 48.55 49.28 53.06 56.49 62.39 70.41 72.98 75.56 88.58 93.54 95.54 128.22 132.30 166.52 175.08 184.92 200.96 211.12 222.49 229.19 241.55 263.18 267.11 274.78 297.65 305.22 307.99 332.07 372.69 390.80 408.94 410.64 414.04 415.31 417.50 419.47 420.72 440.16 462.34 469.40 472.42 492.28 497.74 516.01 536.15 553.58 560.05 582.13 627.39 628.03 630.27 630.76 630.81 631.31 641.53 686.73 703.95 713.20 714.75 722.97 724.22 726.03 728.47 729.05 730.78 736.91 755.96 775.79 781.24 785.48 786.94 789.28 810.05 822.70 866.70 869.69 876.98 881.09 890.98 892.85 900.47 945.13 966.24 968.44 978.65 979.68 980.02 992.83 1001.05 1014.00 1017.99 1020.74 1021.50 1021.76 1023.60 1024.34 1025.30 1026.82 1031.30 1033.46 1046.99 1053.53 1054.25 1055.80 1056.84 1058.21 1060.92 1061.68 1062.74 1064.34 1065.29 1067.54 1069.60 1098.86 1103.38 1108.58 1117.51 1117.66 1126.24 1129.67 1134.89 1139.51 1164.63 1173.04 1175.77 1176.77 1182.92 1185.06 1187.42 1191.35 1192.76 1199.58 1200.61 1203.52 1209.29 1217.91 1225.03 1322.29 1324.39 1330.37 1332.85 1337.55 1338.85 1359.93 1363.72 1366.78 1368.29 1369.62 1376.21 1382.73 1482.49 1484.53 1486.74 1488.08 1490.54 1493.07 1520.32 1521.89 1528.45 1534.53 1535.85 1538.23 1569.49 1651.67 1669.22 1672.93 1673.67 1674.25 1675.07 1679.38 1682.53 1687.53 1692.06 1693.83 1697.66 1699.28 3004.80 3199.92 3203.20 3204.18 3204.53 3205.03 3210.44 3213.35 3215.66 3217.32 3217.58 3217.89 3218.77 3219.78 3223.80 3224.19 3224.54 3224.60 3226.66 3226.91 3231.53 3232.31 3232.46 3233.72 3235.32 3236.21 3238.28 3239.65 3239.69 3240.74 3244.34
frequency: 19.65 23.48 27.24 35.54 39.68 44.40 48.55 49.28 53.06 56.49 62.39 70.41 72.98 75.56 88.58 93.54 95.54 128.22 132.30 166.52 175.08 184.92 200.96 211.12 222.49 229.19 241.55 263.18 267.11 274.78 297.65 305.22 307.99 332.07 372.69 390.80 408.94 410.64 414.04 415.31 417.50 419.47 420.72 440.16 462.34 469.40 472.42 492.28 497.74 516.01 536.15 553.58 560.05 582.13 627.39 628.03 630.27 630.76 630.81 631.31 641.53 686.73 703.95 713.20 714.75 722.97 724.22 726.03 728.47 729.05 730.78 736.91 755.96 775.79 781.24 785.48 786.94 789.28 810.05 822.70 866.70 869.69 876.98 881.09 890.98 892.85 900.47 945.13 966.24 968.44 978.65 979.68 980.02 992.83 1001.05 1014.00 1017.99 1020.74 1021.50 1021.76 1023.60 1024.34 1025.30 1026.82 1031.30 1033.46 1046.99 1053.53 1054.25 1055.80 1056.84 1058.21 1060.92 1061.68 1062.74 1064.34 1065.29 1067.54 1069.60 1098.86 1103.38 1108.58 1117.51 1117.66 1126.24 1129.67 1134.89 1139.51 1164.63 1173.04 1175.77 1176.77 1182.92 1185.06 1187.42 1191.35 1192.76 1199.58 1200.61 1203.52 1209.29 1217.91 1225.03 1322.29 1324.39 1330.37 1332.85 1337.55 1338.85 1359.93 1363.72 1366.78 1368.29 1369.62 1376.21 1382.73 1482.49 1484.53 1486.74 1488.08 1490.54 1493.07 1520.32 1521.89 1528.45 1534.53 1535.85 1538.23 1569.49 1651.67 1669.22 1672.93 1673.67 1674.25 1675.07 1679.38 1682.53 1687.53 1692.06 1693.83 1697.66 1699.28 3004.80 3199.92 3203.20 3204.18 3204.53 3205.03 3210.44 3213.35 3215.66 3217.32 3217.58 3217.89 3218.77 3219.78 3223.80 3224.19 3224.54 3224.60 3226.66 3226.91 3231.53 3232.31 3232.46 3233.72 3235.32 3236.21 3238.28 3239.65 3239.69 3240.74 3244.34
formula: C37H31NO2P2
InChI: InChI=1/C37H31NO2P2/c39-42(35-27-15-5-16-28-35,36-29-17-6-18-30-36)40-41(33-23-11-3-12-24-33,34-25-13-4-14-26-34)38-37(31-19-7-1-8-20-31)32-21-9-2-10-22-32/h1-30,38H
73 atoms
C  2.615249 -0.626658 -1.161745
C  3.359396 -1.61576 -1.824386
C  3.193763 0.630237 -0.922262
C  4.658353 -1.348627 -2.246579
H  2.92751 -2.600943 -2.013726
C  4.484459 0.894655 -1.371266
H  2.643276 1.412854 -0.392898
C  5.219689 -0.091865 -2.028271
H  5.230934 -2.128182 -2.75356
H  4.920828 1.880765 -1.197959
H  6.236243 0.119624 -2.368105
C  0.378815 -2.197647 -1.957029
C  -0.049057 -3.484364 -1.633144
C  0.376649 -1.772649 -3.292976
C  -0.496595 -4.345266 -2.636764
H  -0.046092 -3.814605 -0.590482
C  -0.073428 -2.632543 -4.289856
H  0.729814 -0.772034 -3.559511
C  -0.513123 -3.917501 -3.961472
H  -0.832723 -5.352131 -2.379053
H  -0.075142 -2.302322 -5.331432
H  -0.863134 -4.590318 -4.747853
P  0.963607 -1.072914 -0.568872
N  -0.09135 0.308945 -0.977624
C  -1.369175 0.345283 -1.250645
C  -2.202202 -0.87043 -1.158106
C  -2.951514 -1.314963 -2.254303
C  -2.251023 -1.559831 0.060954
C  -3.710084 -2.474635 -2.139436
H  -2.912748 -0.770597 -3.200913
C  -3.045347 -2.69629 0.177267
H  -1.690722 -1.191205 0.924511
C  -3.76155 -3.161066 -0.92469
H  -4.270321 -2.84296 -3.001238
H  -3.098133 -3.221865 1.133005
H  -4.370477 -4.063879 -0.837813
C  -1.982575 1.635859 -1.572129
C  -3.361588 1.819248 -1.364516
C  -1.199014 2.713627 -2.024945
C  -3.940114 3.061628 -1.593193
H  -3.96991 0.991812 -0.994046
C  -1.785217 3.949918 -2.256738
H  -0.131721 2.58114 -2.21671
C  -3.153314 4.125017 -2.037638
H  -5.008774 3.204125 -1.420776
H  -1.175439 4.782134 -2.6133
H  -3.610649 5.100706 -2.218394
P  0.822076 1.053128 1.738482
O  1.147563 -0.398635 1.109503
C  2.031197 1.244339 3.049566
C  1.846234 2.264208 3.992575
C  3.165886 0.428285 3.105215
C  2.797428 2.464369 4.98811
H  0.956613 2.899644 3.95245
C  4.114322 0.635582 4.104629
H  3.298787 -0.367519 2.368794
C  3.929924 1.650173 5.043018
H  2.65396 3.256797 5.725941
H  5.002272 0.001246 4.151205
H  4.674774 1.808894 5.826526
C  -0.829485 0.907153 2.450841
C  -1.83088 1.777816 2.010077
C  -1.133988 -0.117338 3.35771
C  -3.139524 1.615039 2.464916
H  -1.574624 2.576752 1.308697
C  -2.441004 -0.273742 3.809023
H  -0.348104 -0.795226 3.703637
C  -3.443362 0.589339 3.358017
H  -3.921924 2.297498 2.12447
H  -2.681753 -1.06868 4.518563
H  -4.468228 0.464535 3.715856
O  0.840644 2.136819 0.675412
H  0.329465 1.228737 -0.681987
totalener: -2314.45426290 hartree
nucrepener: 5459.81886095 hartree
electener: -7774.27312385 hartree
twoeener: 6222.70049699 hartree
kineticenergy: 2294.13863883 hartree
xcener: -196.377711969345 hartree
s2: 0.756579
dispersion: -0.054649430 hartree
s2: 0.756513
dispersion: -0.055171028 hartree
s2: 0.756618
dispersion: -0.055162505 hartree
s2: 0.756897
dispersion: -0.054007376 hartree
s2: 0.756690
dispersion: -0.054545695 hartree
s2: 0.756539
dispersion: -0.054958974 hartree
s2: 0.756631
dispersion: -0.054780598 hartree
s2: 0.756629
dispersion: -0.054656115 hartree
s2: 0.756607
dispersion: -0.054749308 hartree
s2: 0.756642
dispersion: -0.054928569 hartree
s2: 0.756647
dispersion: -0.054851126 hartree
s2: 0.756564
dispersion: -0.054848443 hartree
s2: 0.756604
dispersion: -0.054803857 hartree
s2: 0.756632
dispersion: -0.055011576 hartree
s2: 0.756625
dispersion: -0.054894952 hartree
s2: 0.756621
dispersion: -0.054901698 hartree
s2: 0.756620
dispersion: -0.054967142 hartree
dispersion: -0.054969635 hartree
dispersion: -0.054972254 hartree
dispersion: -0.054982609 hartree
dispersion: -0.054975143 hartree
dispersion: -0.054974633 hartree
dispersion: -0.054975442 hartree
dispersion: -0.054975317 hartree
dispersion: -0.054976019 hartree
chargesum: 1.0000000
charge: -0.137294 0.001720 -0.057687 -0.015798 0.043834 -0.006204 0.044214 0.003933 0.046960 0.045228 0.050780 -0.252542 0.023668 0.014332 -0.013149 0.027153 -0.017491 0.029661 -0.004672 0.043352 0.044345 0.048060 0.819308 -0.259244 0.161100 -0.102240 0.024238 0.014708 -0.009364 0.037444 -0.006629 0.024553 0.004544 0.050353 0.043523 0.053615 -0.020112 -0.000342 -0.004479 -0.015169 0.057330 -0.012770 0.048116 0.017650 0.052786 0.056480 0.061973 0.962528 -0.625664 -0.200840 0.010232 0.000792 -0.015977 0.036905 -0.011607 0.035028 0.002134 0.045185 0.042206 0.047925 -0.248110 -0.012914 0.011926 -0.012303 0.045169 -0.024437 0.043400 0.001060 0.037015 0.045620 0.047855 -0.541135 0.218234
charge: -0.202323 -0.014248 -0.027409 -0.018779 0.039816 -0.016273 0.028134 0.004193 0.044720 0.044748 0.045397 -0.205942 -0.023756 -0.031489 -0.017159 0.032953 -0.019966 0.033509 -0.005920 0.042617 0.042913 0.043894 0.871960 -0.037102 0.162940 -0.068159 0.006197 -0.009402 -0.008943 0.043161 -0.014134 0.036707 0.005694 0.046568 0.044814 0.046680 -0.073235 0.019076 0.017838 -0.019377 0.046321 -0.011307 0.043808 0.025996 0.047709 0.049866 0.050427 0.937580 -0.473387 -0.207740 -0.011651 -0.012765 -0.018116 0.038673 -0.020662 0.035904 0.001785 0.043299 0.042058 0.043928 -0.217921 -0.022566 -0.017327 -0.025269 0.037662 -0.022847 0.040851 -0.002551 0.039445 0.042986 0.043692 -0.508375 0.069579
qa: -0.1373 0.0017 -0.0577 -0.0158 0.0438 -0.0062 0.0442 0.0039 0.0470 0.0452 0.0508 -0.2525 0.0237 0.0143 -0.0131 0.0272 -0.0175 0.0297 -0.0047 0.0434 0.0443 0.0481 0.8193 -0.2592 0.1611 -0.1022 0.0242 0.0147 -0.0094 0.0374 -0.0066 0.0246 0.0045 0.0504 0.0435 0.0536 -0.0201 -0.0003 -0.0045 -0.0152 0.0573 -0.0128 0.0481 0.0177 0.0528 0.0565 0.0620 0.9625 -0.6257 -0.2008 0.0102 0.0008 -0.0160 0.0369 -0.0116 0.0350 0.0021 0.0452 0.0422 0.0479 -0.2481 -0.0129 0.0119 -0.0123 0.0452 -0.0244 0.0434 0.0011 0.0370 0.0456 0.0479 -0.5411 0.2182
va: 3.7838 3.9275 3.9221 3.9015 0.9933 3.8978 1.0598 3.8495 0.9847 0.9849 0.9840 3.7418 3.8979 3.8785 3.8958 0.9991 3.8914 0.9951 3.8551 0.9852 0.9843 0.9840 4.0541 3.3227 3.8989 3.8374 3.8887 3.9047 3.8898 0.9965 3.8814 1.0078 3.8503 0.9851 0.9859 0.9839 3.8072 3.8820 3.8862 3.8799 0.9929 3.9079 0.9950 3.8520 0.9851 0.9850 0.9833 4.8530 1.9115 3.7918 3.9137 3.9339 3.9043 0.9935 3.8789 1.0076 3.8622 0.9848 0.9850 0.9840 3.7583 3.9201 3.8822 3.8653 1.0104 3.8836 0.9964 3.8511 0.9877 0.9847 0.9839 2.0515 1.0576
dispersion: -0.054976214 hartree
energy: -2314.510187245067 hartree
dipole: -6.78735 5.33902 -1.44832 -1.58336 1.14345 -0.43992 -3.93780 2.87330 -1.06450
magnitude: 1.85049 au
magnitude: 4.70357 debye
temp: 298.15 k
press: 1.00 atm
zeropoint: 0.58910950 hartree
thermalvibcorrection: 0.03291784 hartree
thermalrotcorrection: 0.00141627 hartree
thermaltrasncorrection: 0.00141627 hartree
thermaltotal: -2313.88532736 hartree
thermalcorr: 0.03575039 hartree
nonthermalcorr: 0.58910950 hartree
totalcorr: 0.62485988 hartree
thermalcorrenthalpy: 0.00094421 hartree
totalenthalpy: -2313.88438315 hartree
vibrat: 0.05869498 hartree
rotat: 0.01795425 hartree
transl: 0.02136963 hartree
total: 0.09867331 hartree
totalentropycorr: -0.09867331 hartree
gibbsenthalpy: -2313.98305646 hartree
gibbsminuselec: 0.52713078 hartree
