program: Gaussian 16
title: prereaction
version: ES64L-G16RevC.02
basis: def2SVP
method: UwB97XD
operation: Freq
keyword: #p
keyword: uwb97xd
keyword: scrf=(smd,solvent=dichloromethane)
keyword: nosymm
keyword: guess=(mix)
keyword: def2svp
keyword: scf=xqc
keyword: freq
title: #p uwb97xd scrf=(smd,solvent=dichloromethane) nosymm guess=(mix) def2s
basis: NPDir=0 NMtPBC= 1 NCelOv= 1 NCel= 1 NClECP= 1 NCelD= 1
basis: NCelK= 1 NCelE2= 1 NClLst= 1 CellRange= 0.0.
basis: One-electron integrals computed using PRISM.
converged: NO NO NO NO
polarizability: 6.76964636e+02 1.76998329e+01 6.05293450e+02 5.56331777e+00 2.13796778e+00 5.88419867e+02
1716.lowfreq: -92.8210 -2.8006 -0.0015 -0.0012 -0.0009 7.9823 13.8490 28.1276 30.6862
frequency: -92.7034 27.7239 30.4646 34.6819 36.1847 37.7860 40.9555 49.1621 51.8248 55.2401 59.1261 64.9175 70.8576 76.7419 84.4965 91.7362 96.2531 101.4127 127.8177 131.6059 165.7303 177.5837 190.1387 196.9577 214.5952 221.8943 234.4334 241.0300 258.7858 269.0503 271.4074 291.8596 296.4825 306.4392 349.0715 366.8709 377.0734 411.2705 412.9959 414.3785 417.0954 418.7140 421.3602 425.9675 438.2752 458.2331 472.7185 486.1267 491.7729 500.9369 509.1006 529.9658 540.8035 569.6742 625.4065 628.5295 628.8752 629.9231 630.6330 630.9793 632.4250 650.5992 688.6300 696.3109 712.2351 715.6428 719.3872 721.0540 721.7267 723.9673 726.2409 727.2536 729.6654 757.7137 763.7217 775.3224 779.4604 782.0989 784.3419 801.6356 808.4089 847.2531 872.6868 879.2099 883.8196 887.5375 888.4803 888.9882 959.9704 968.5619 978.1101 978.7965 979.0503 983.3933 990.4311 1011.7539 1016.3718 1017.4749 1017.8655 1018.7355 1020.6376 1025.9225 1026.9571 1028.6413 1033.0351 1033.5686 1035.8599 1051.7552 1052.4343 1053.3938 1055.2045 1055.5000 1056.4584 1056.6487 1057.5522 1059.8716 1060.6525 1061.3319 1063.5650 1088.8094 1107.8870 1110.4231 1113.6782 1116.5392 1120.7559 1125.9305 1132.5484 1133.3519 1159.4222 1168.8101 1169.6661 1170.7154 1171.9580 1172.0567 1173.0813 1195.4195 1195.4597 1200.5876 1201.5545 1203.7469 1208.0830 1211.8721 1248.5113 1323.2470 1325.5734 1329.1536 1333.0142 1334.3710 1341.3940 1357.6409 1362.7319 1369.7612 1370.3069 1373.7957 1375.4414 1379.9444 1473.9426 1477.1322 1477.6549 1481.0553 1481.5818 1486.8918 1507.0192 1516.4494 1524.8886 1526.3722 1527.4825 1533.9082 1559.9264 1633.4916 1657.8727 1662.9105 1663.8581 1664.3671 1665.2755 1669.4046 1671.4244 1677.0649 1679.4539 1681.1451 1686.9431 1689.9876 3198.4138 3200.7781 3208.2696 3208.3205 3211.5317 3211.9937 3213.5957 3213.6531 3214.8360 3215.5293 3217.0626 3219.3964 3219.5046 3220.2890 3222.0921 3222.3929 3225.0215 3227.0507 3227.5209 3228.8456 3228.9762 3229.5112 3232.6420 3233.1877 3234.4270 3235.2403 3236.0220 3237.9382 3239.5181 3246.9653 3490.9824
redmass: 10.6060 5.7370 5.3872 4.6846 4.3911 4.9826 4.9530 5.5968 4.1733 5.0705 5.0400 5.2405 4.1469 3.9680 3.9647 4.7727 5.4979 4.8360 5.6709 6.0382 7.9230 5.7453 5.2748 5.9988 4.9823 5.0122 4.8367 5.6078 5.3707 5.4110 4.5797 7.2454 7.3798 5.4236 7.4280 7.2402 6.1725 2.8846 3.7863 3.3717 2.8799 2.9459 3.3992 3.0470 6.9052 4.9342 4.1173 4.5703 4.5885 4.0689 3.9542 5.4014 7.9752 6.6231 6.0501 6.4175 6.3739 6.4285 6.3266 6.5055 6.1716 7.4206 6.1528 3.5515 5.4620 1.6070 3.4870 2.4699 1.9112 2.0897 1.8986 2.0987 1.8385 6.5761 2.8386 1.7182 1.7685 1.8275 1.7118 1.8277 2.3417 2.1661 1.2516 1.2504 1.2478 1.2468 1.2448 1.2442 2.7263 1.3558 1.3549 1.4057 1.3687 1.3419 1.8898 6.3780 5.6301 5.9682 5.7585 4.9146 3.3777 1.3938 1.4038 1.6631 1.3861 1.3827 1.3790 2.8220 1.5357 1.3704 1.3617 1.3483 1.6381 1.7328 1.5642 2.0179 2.5094 2.1909 1.9064 2.0476 1.5207 1.4956 1.5134 1.5517 1.4764 1.4575 2.9316 3.0564 3.1664 1.0845 1.0823 1.0779 1.0873 1.0840 1.0764 1.1322 1.1307 1.1845 1.1297 1.1672 1.1453 2.4776 12.0534 1.8124 1.7204 1.5088 1.7871 1.5320 1.4589 1.9042 4.0198 3.3549 2.7574 5.0107 4.4509 4.7134 2.3244 2.3617 2.3542 2.1038 2.3686 2.5050 1.7998 2.1966 2.2607 2.1461 2.2451 2.3831 2.4473 6.0436 5.8015 6.0402 6.0991 5.9607 6.1677 6.6013 6.2695 5.9836 6.0730 6.0380 6.2250 6.2198 1.0889 1.0907 1.0903 1.0888 1.0919 1.0878 1.0901 1.0902 1.0881 1.0902 1.0903 1.0947 1.0924 1.0937 1.0917 1.0941 1.0936 1.0968 1.0936 1.0960 1.0979 1.1011 1.0981 1.1014 1.0978 1.1017 1.1004 1.1000 1.1013 1.0953 1.0759
irintensity: 165.2586 0.2605 3.3285 1.7120 0.0725 0.5809 1.8494 1.3382 0.1058 0.5730 6.8519 3.4170 0.0897 4.0677 1.1591 0.4085 13.9203 6.2220 0.9333 1.7013 19.7327 7.4119 2.6371 8.4105 23.5753 3.4473 5.0267 10.1569 4.7366 1.9929 0.7261 46.5651 28.8779 2.6756 27.0023 135.0316 29.7169 1.5724 63.8022 38.2511 1.9787 13.1295 36.2423 11.7015 55.2971 6.5384 5.3276 115.6947 32.2292 49.8894 125.9916 104.1047 336.1414 37.9434 64.7493 3.3288 1.7958 13.5053 0.3484 24.6419 4.8194 126.6955 101.4268 28.3758 11.1595 59.2519 79.4548 29.8210 58.3046 21.8498 115.5670 63.5421 32.5661 138.3554 104.8068 42.7804 37.9063 6.6060 27.5686 184.4303 70.8526 116.8593 5.1379 3.8168 0.5414 0.1146 0.3106 0.3091 20.5679 0.7319 1.2958 6.8736 5.9456 0.7134 8.8549 2.5307 4.5238 1.8234 1.9381 5.7821 0.8438 0.1014 1.2504 6.3853 0.4389 0.1190 0.2735 0.9603 0.8377 0.3756 0.1577 0.0786 0.8345 1.0430 1.7787 2.6123 4.3017 5.2828 9.2934 74.9063 9.1716 17.6570 4.0143 3.1740 14.4947 7.3117 54.9220 21.0959 225.2092 0.4235 0.9513 1.1133 1.4893 1.3761 2.5088 2.2207 1.7712 13.0567 11.6559 16.8500 9.8994 8.7090 250.2833 93.3748 60.9316 5.1299 4.2832 5.1925 3.8574 162.5853 12.4241 4.4448 6.3138 3.3018 11.4916 25.3470 17.9545 83.6310 24.7427 7.6156 39.3098 7.2687 81.1009 4.7152 1.3524 19.3843 1.6253 5.7072 97.3696 752.8153 12.1875 3.9297 11.7103 3.6691 2.4291 114.4293 2.2461 1.9523 16.2970 23.4369 109.0288 16.6896 0.4457 1.4939 1.7678 10.9436 0.0419 0.0449 7.8066 7.6137 0.2703 0.5239 1.3910 10.4939 2.0731 1.3282 2.4687 0.2850 4.1868 6.2533 2.4400 4.2723 5.5079 16.1517 3.9980 17.8076 2.8735 7.6918 3.8335 7.8729 5.4427 7.0109 270.4260
temp: 298.150 k
press: 1.00000 atm
elementType: 6 6 6 6 1 6 1 6 1 1 1 6 6 6 6 1 6 1 6 1 1 1 15 7 6 6 6 6 6 1 6 1 6 1 1 1 6 6 6 6 1 6 1 6 1 1 1 15 8 6 6 6 6 1 6 1 6 1 1 1 6 6 6 6 1 6 1 6 1 1 1 8 1
symmnumber: 1
zpe: 1541350.7 jmol-1
zpe.correction: 0.587069 hartree
zpe.thermalcorrener: 0.622692 hartree
zpe.thermalcorrenthalpy: 0.623637 hartree
zpe.thermalcorrgfe: 0.516906 hartree
zpe.sumelectzpe: -2313.893080 hartree
zpe.sumelectthermal: -2313.857457 hartree
zpe.sumelectthermalent: -2313.856513 hartree
zpe.sumelectthermalfe: -2313.963244 hartree
dipole: -5.5876 -0.0474 -1.4631
dipole: 5.7762
quadrupole: -188.6095 -218.2680 -191.9244
quadrupole: -0.6600 8.9949 0.7005
quadrupole: 10.9911 -18.6673 7.6762 -0.6600 8.9949 0.7005
hfenergy: -2314.4801496 hartree
pointgroup: C01 [X(C37H31N1O2P2)]
dipole: -2.1314084 -0.0325504 -0.5416958 debye
polarizability: 676.9646356|17.6998329|605.2934496|5.5633178|2.1379678|588.4198668 unknown
InChI: InChI=1/37C.N.2O.2P.31H
charge 1 multiplicity 2
73 atoms
C  2.61627 -0.500946 -1.234676
C  3.34644 -1.407806 -2.020659
C  3.187482 0.742354 -0.917982
C  4.614143 -1.071114 -2.488154
H  2.928745 -2.385371 -2.268951
C  4.449936 1.077751 -1.403006
H  2.649704 1.46461 -0.29928
C  5.167311 0.173355 -2.185725
H  5.171948 -1.788269 -3.094233
H  4.876032 2.053666 -1.160336
H  6.159613 0.437235 -2.558391
C  0.374017 -2.159252 -1.918167
C  0.022717 -3.462024 -1.567548
C  0.25825 -1.737477 -3.2499
C  -0.46143 -4.342155 -2.538277
H  0.113717 -3.789377 -0.528074
C  -0.218685 -2.618367 -4.216681
H  0.541107 -0.720863 -3.537191
C  -0.584199 -3.919653 -3.860113
H  -0.745676 -5.358729 -2.257346
H  -0.306896 -2.288945 -5.254679
H  -0.964797 -4.606187 -4.61993
P  1.01994 -1.022432 -0.545361
N  -0.090436 0.335675 -1.018682
C  -1.373039 0.345918 -1.262198
C  -2.201747 -0.844164 -1.004775
C  -3.077959 -1.313795 -1.993744
C  -2.119455 -1.501573 0.230974
C  -3.838529 -2.453458 -1.755312
H  -3.14038 -0.801344 -2.955851
C  -2.911108 -2.618955 0.474065
H  -1.4521 -1.129035 1.009016
C  -3.760608 -3.101898 -0.521119
H  -4.500891 -2.834879 -2.534761
H  -2.85775 -3.11684 1.44409
H  -4.37021 -3.988524 -0.333461
C  -1.987335 1.574017 -1.78116
C  -3.333368 1.858164 -1.494275
C  -1.230929 2.484418 -2.53991
C  -3.90325 3.044894 -1.941766
H  -3.923421 1.161569 -0.896691
C  -1.81135 3.662013 -2.994508
H  -0.194612 2.258654 -2.802463
C  -3.14467 3.945293 -2.691114
H  -4.944922 3.268915 -1.704447
H  -1.224053 4.359498 -3.594477
H  -3.59732 4.873432 -3.04694
P  0.763497 1.207305 1.853063
O  1.088198 -0.498306 1.052923
C  1.96922 1.122425 3.178726
C  1.715812 1.806733 4.375478
C  3.182712 0.448266 2.989846
C  2.679694 1.812723 5.381433
H  0.769549 2.332695 4.527636
C  4.139846 0.462259 4.000917
H  3.36775 -0.092457 2.059864
C  3.888695 1.142229 5.19378
H  2.483732 2.342535 6.315912
H  5.085448 -0.064721 3.857909
H  4.641304 1.147381 5.985603
C  -0.90766 1.013665 2.461686
C  -1.918693 1.774066 1.862929
C  -1.218633 0.052311 3.433404
C  -3.245635 1.566659 2.234238
H  -1.664972 2.518163 1.104687
C  -2.546453 -0.147044 3.798243
H  -0.427238 -0.543838 3.894365
C  -3.557898 0.605232 3.195127
H  -4.03762 2.157579 1.76951
H  -2.795842 -0.895475 4.553034
H  -4.599271 0.441109 3.481074
O  0.921459 2.294605 0.834904
H  0.364685 1.256179 -1.019323
