program: Gaussian 16
title: p-benzyne addition to benzene - ts guess oss - ircf sp t - opt oss
version: ES64L-G16RevC.01
method: UM062X
basis: 6-311++G(d,p)
operation: Freq
keyword: #P
keyword: Geom=AllCheck
keyword: Guess=TCheck
keyword: SCRF=Check
keyword: GenChk
keyword: UM062X/6-311++G(d,p)
keyword: Freq
converged: YES YES YES YES
polarizability: 1.41416145e+02 9.80735211e+00 2.04930328e+02 1.54650609e-01 -7.58547859e-02 1.26724307e+02
1716.lowfreq: -12.3161 -0.0006 -0.0006 -0.0005 4.2352 14.6903 31.0191 53.5382 110.4972
frequency: 31.0064 53.4915 110.4953 233.9068 286.2139 310.2144 401.6505 407.5093 497.8266 521.6428 581.7223 587.5566 612.0082 626.9210 691.1772 711.9495 768.0842 798.0973 817.4550 835.0697 863.9730 912.5152 963.5283 987.7582 988.9219 993.3034 994.5650 995.8281 1000.9389 1037.4836 1059.5842 1106.1566 1106.4433 1169.4157 1178.8544 1193.8936 1208.7190 1230.0500 1305.2267 1308.8892 1317.4654 1346.6088 1399.1190 1415.4999 1451.6255 1493.6189 1559.6560 1614.8213 1624.1051 1652.8467 2978.6272 3184.5411 3190.0373 3190.4605 3190.8916 3206.6138 3207.5098 3210.7827 3213.3065 3232.1085
redmass: 3.7558 4.3544 4.3955 3.5437 4.5093 5.0557 2.8340 3.1195 3.3650 2.9437 6.1468 6.4484 5.5551 1.5396 2.7768 2.9779 1.2956 2.0497 1.5679 1.2515 2.2690 3.7883 1.3613 1.3801 5.5200 1.3028 1.3963 2.3657 5.1190 1.9750 2.1010 1.5353 1.3684 1.0509 1.1439 1.2257 2.1543 1.7457 2.7925 1.3615 3.5658 1.4549 1.8580 2.6889 1.6517 2.4315 3.3302 5.4242 5.5601 7.4987 1.0804 1.0893 1.0862 1.0853 1.0884 1.0934 1.0956 1.0927 1.0941 1.0943
irintensity: 0.0061 0.0301 0.0965 0.0486 0.2317 0.5929 0.0169 3.1450 3.6531 24.6648 3.3216 0.4161 0.7786 59.2189 65.8836 6.5211 1.1296 1.7140 71.3910 0.3088 37.5101 5.2607 0.8451 0.0388 6.5324 0.5773 0.7042 2.7986 0.5078 3.8621 14.9830 0.0361 10.6539 0.0028 0.5021 1.0603 1.2335 0.9864 5.2856 0.4449 1.0867 0.1229 1.8315 7.1788 5.2336 15.5046 1.5593 9.5709 1.4501 1.4476 15.7853 1.9369 5.0368 0.3914 5.1819 0.8637 28.6956 5.7223 0.6119 13.9869
temp: 403.150 k
press: 1.00000 atm
elementType: 6 6 6 6 6 6 1 1 1 6 6 6 6 1 6 1 6 1 1 1 1 1
symmnumber: 1
zpe: 467562.2 jmol-1
zpe.correction: 0.178085 hartree
zpe.thermalcorrener: 0.195106 hartree
zpe.thermalcorrenthalpy: 0.196383 hartree
zpe.thermalcorrgfe: 0.124490 hartree
zpe.sumelectzpe: -462.888524 hartree
zpe.sumelectthermal: -462.871503 hartree
zpe.sumelectthermalent: -462.870226 hartree
zpe.sumelectthermalfe: -462.942119 hartree
dipole: 0.7797 0.4191 0.0071
dipole: 0.8852
quadrupole: -71.6479 -66.2805 -71.0166
quadrupole: -5.4115 0.0097 -0.0695
quadrupole: -1.9996 3.3679 -1.3683 -5.4115 0.0097 -0.0695
hfenergy: -463.066609 hartree
pointgroup: C01 [X(C12H10)]
dipole: 0.3067553 0.1649038 0.0027977 debye
dipolederiv: -0.0525334 -0.0575456 0.0007762 -0.0913781 -0.1126396 -0.0009417 0.0008144 -0.000365 -0.1105512 -0.1190653 -0.0970421 0.000147 -0.0831063 -0.0462488 -0.0011231 0.0001476 -0.001723 -0.1185421 0.0398045 -0.0816773 0.00238 -0.0231573 0.0699623 -0.0006907 0.0021936 -0.0012092 -0.1590358 0.0641695 0.3466373 0.0004796 0.1952613 0.1290578 0.0016405 0.0006589 0.0033332 -0.0589996 -0.0210896 -0.0904656 0.0013581 -0.0284256 -0.0638607 -0.0005417 0.0014881 -0.0012161 -0.1405981 0.00397 -0.0915799 0.0014621 -0.0361393 -0.0318093 -0.0005509 0.0012582 -0.0010285 -0.1050716 0.0973522 0.0276754 -0.0009013 0.0229113 -0.0468459 0.000798 -0.0008771 0.0008685 0.1765902 0.1058125 0.0279681 -0.0002959 0.0354803 -0.0468126 0.0007797 -0.0002575 0.0006514 0.1306485 -0.0290041 0.0231994 -0.0022054 0.0474556 0.0861017 0.0007071 -0.0022422 0.0004487 0.1734403 0.2726534 0.0230157 0.0032887 -0.030674 -0.0881889 -0.0002361 0.0031326 -0.0000336 -0.0323499 -0.2997964 -0.1196012 0.0085505 -0.0342148 0.1277749 -0.0281534 -0.0974396 -0.1019946 -0.0046216 -0.3018591 -0.1216901 -0.0137927 -0.0344829 0.1282465 0.0268033 0.0916387 0.0993536 -0.0030481 -0.1481472 -0.0055786 0.0094609 -0.0417928 -0.1502504 -0.0673408 0.0407073 0.006214 0.1091201 0.1566823 0.019466 -0.0009314 0.0245049 0.0327226 -0.0587268 0.0156723 -0.0544927 -0.0537408 -0.1468829 -0.0055472 -0.0145418 -0.0430808 -0.1501483 0.0675411 -0.0459188 -0.0055387 0.107554 0.1568641 0.0184386 0.0047148 0.0232347 0.0331316 0.0589211 -0.0115576 0.0546034 -0.0546446 -0.1752261 -0.0492371 -0.0011739 -0.0386646 0.1448613 -0.0007593 -0.001214 -0.000757 -0.0404275 0.1705047 0.0359124 -0.0046637 -0.0040059 0.0248205 0.0774492 0.0003966 0.0873308 -0.0608514 0.1702659 0.03759 0.0089713 -0.0023929 0.0241842 -0.0777848 0.004322 -0.0868671 -0.0599066 0.1651696 0.0309488 0.0009684 0.0207647 -0.0958113 0.0005096 0.001018 0.0005652 0.0611412 -0.0303484 0.0705257 -0.001491 0.1141187 -0.0546344 0.0014735 -0.0014986 0.0010881 0.0948975 -0.0792961 0.0585873 -0.0025604 0.0077838 0.0863868 0.0002261 -0.0024428 0.0007685 0.1489971 unknown
polarizability: 141.4161446|9.8073521|204.9303284|0.1546506|-0.0758548|126.7243073 unknown
InChI: InChI=1/C12H10/c1-3-7-11(8-4-1)12-9-5-2-6-10-12/h1,3-11H
charge 0 multiplicity 1
22 atoms
C  -2.00773028 -2.67354921 -0.01522416
C  -0.72059327 -3.14801968 -0.00025428
C  0.30471062 -2.19421875 0.00833885
C  0.00940455 -0.83247253 0.00186006
C  -1.32409732 -0.41361711 -0.01336505
C  -2.36365698 -1.34435551 -0.02222745
H  -0.49433175 -4.20791334 0.00480671
H  -1.5463713 0.64976986 -0.01837849
H  -3.39887605 -1.02393769 -0.03409496
C  1.12335437 0.21833675 0.01102477
C  1.07850034 1.05101062 -1.24120589
C  1.05314564 1.05602408 1.25875341
C  0.92293358 2.40126154 -1.21963889
H  1.15248929 0.52006518 -2.18417718
C  0.89815798 2.40616665 1.22864026
H  1.10801548 0.52886494 2.20514739
C  0.82064837 3.11368198 0.00216755
H  0.87787936 2.94771642 -2.15532488
H  0.83421361 2.95636903 2.16102409
H  0.69425252 4.18806203 -0.00126438
H  2.06836818 -0.34709959 0.02181204
H  1.33998907 -2.52041966 0.02020047
