program: Gaussian 16
title: Anthracene + Me radical
version: ES64L-G16RevC.01
method: UM062X
basis: 6-311++G(d,p)
operation: Freq
keyword: #P
keyword: Geom=AllCheck
keyword: Guess=TCheck
keyword: SCRF=Check
keyword: GenChk
keyword: UM062X/6-311++G(d,p)
keyword: Freq
converged: YES YES NO YES
polarizability: 3.04192562e+02 7.32360112e+01 2.02761241e+02 -1.24766511e+00 4.98621544e+01 1.62665423e+02
1716.lowfreq: -16.3838 -10.5418 -0.6922 -0.0002 0.0006 0.0006 22.4863 49.6913 69.3312
frequency: 22.4782 49.6514 69.3111 82.0646 100.2322 119.6397 121.2295 144.1122 233.8242 235.9340 268.7889 385.5650 394.5262 398.4953 434.7073 473.8711 484.2461 497.7803 531.3738 587.4530 611.6416 635.3248 658.8225 743.6752 749.1489 766.6766 774.0802 779.8221 830.0921 856.3593 873.5430 913.5601 914.5468 915.7118 923.9639 997.4252 1001.2247 1013.9989 1014.7967 1028.6408 1035.7388 1134.2882 1141.7506 1174.8725 1184.8476 1188.9479 1209.0338 1289.3508 1294.5794 1299.5004 1348.5951 1364.2754 1399.9885 1400.4535 1412.8104 1444.7941 1463.7867 1486.2182 1496.9422 1526.5954 1606.4836 1632.4156 1652.5590 1704.9036 1707.8350 3130.2413 3188.6707 3190.5003 3195.8076 3196.5006 3199.3383 3200.2553 3213.6166 3214.4271 3224.9723 3225.7887 3309.7381 3313.2124
redmass: 3.9092 2.8538 1.1200 3.9949 1.0439 4.0824 3.5850 1.0267 4.4499 4.7738 3.6712 3.2764 4.6142 6.6692 1.2356 2.4397 2.7702 3.5458 6.2760 3.3726 6.7621 6.6483 6.0741 4.6378 1.1977 3.5394 5.5272 1.3548 3.7021 1.2663 1.4585 1.5700 5.3743 1.4707 5.4885 1.3305 1.3567 1.2859 1.2904 2.2690 2.3390 2.0467 1.5095 1.3175 1.0546 1.2407 1.1949 1.8615 1.4409 2.8074 3.1527 2.6762 1.1017 1.1015 1.6111 3.8903 8.3530 2.2455 3.1723 2.9491 5.6289 7.7031 5.6753 6.1691 6.6487 1.0079 1.0909 1.0913 1.0869 1.0870 1.0890 1.0891 1.0950 1.0950 1.0982 1.0982 1.1189 1.1187
irintensity: 0.0065 0.0510 0.1541 0.9306 0.2593 1.5790 0.0550 0.1809 2.2083 0.0347 0.1272 0.0656 0.0005 0.0359 102.7754 39.2900 0.1243 0.0386 0.0004 0.0035 12.6180 0.0100 1.0149 0.0645 124.8685 0.1177 0.0051 0.1141 0.1652 0.0029 0.0225 0.9756 3.2636 92.3395 0.0026 0.0985 7.3916 0.0439 0.0040 12.5272 0.0050 0.0039 3.2475 10.3164 0.0007 1.8359 0.0007 4.6473 0.0027 0.0342 9.7352 6.9895 2.5374 5.1698 0.0094 2.4652 0.0073 0.9807 1.3266 0.0347 11.1276 0.0075 0.0022 4.2617 0.0016 0.5776 10.7650 0.0595 2.6105 2.7012 0.9288 0.1780 18.0391 21.0578 22.7635 12.0082 1.5526 1.8624
temp: 403.150 k
press: 1.00000 atm
elementType: 6 6 6 6 6 6 6 6 6 6 6 1 6 6 6 1 1 1 1 1 1 1 1 1 6 1 1 1
symmnumber: 1
zpe: 592408.6 jmol-1
zpe.correction: 0.225637 hartree
zpe.thermalcorrener: 0.250479 hartree
zpe.thermalcorrenthalpy: 0.251756 hartree
zpe.thermalcorrgfe: 0.160203 hartree
zpe.sumelectzpe: -579.030181 hartree
zpe.sumelectthermal: -579.005338 hartree
zpe.sumelectthermalent: -579.004061 hartree
zpe.sumelectthermalfe: -579.095615 hartree
dipole: 0.0219 0.0406 -0.1314
dipole: 0.1392
quadrupole: -78.1332 -85.9142 -89.7279
quadrupole: 3.7883 -3.8551 10.3606
quadrupole: 6.4585 -1.3224 -5.1361 3.7883 -3.8551 10.3606
hfenergy: -579.2558175 hartree
pointgroup: C01 [X(C15H13)]
dipole: 0.0086177 0.0159609 -0.0516819 debye
polarizability: 304.1925624|73.2360112|202.7612408|-1.2476651|49.8621544|162.6654233 unknown
InChI: InChI=1/C14H10.CH3/c1-2-6-12-10-14-8-4-3-7-13(14)9-11(12)5-1;/h1-10H;1H3
charge 0 multiplicity 2
28 atoms
C  -2.94462632 -2.24629509 -1.25582137
C  -1.63938733 -2.0616276 -1.59706584
C  -0.86047463 -1.02829471 -0.98515466
C  -1.4820102 -0.18706591 -0.00255714
C  -2.8564971 -0.41427526 0.32638582
C  -3.56331585 -1.40883115 -0.27818153
C  0.48031001 -0.81994468 -1.31286656
C  -0.73287088 0.82225295 0.60496102
C  0.61021505 1.02351864 0.28417896
C  1.23133762 0.18269806 -0.69826942
C  2.61674884 0.38044932 -0.99558888
H  3.08309565 -0.2598015 -1.73675195
C  3.33701238 1.34243462 -0.35503426
C  2.71810799 2.18112908 0.62136781
C  1.39939659 2.02963793 0.92622706
H  -3.52473565 -3.03191267 -1.72515611
H  -1.16552616 -2.69506578 -2.33925503
H  -3.32262029 0.22434825 1.06904786
H  -4.60318232 -1.57226591 -0.02134124
H  -1.20245836 1.45693736 1.35058246
H  4.38749036 1.47939498 -0.58261356
H  3.30839762 2.94198102 1.11816628
H  0.92537112 2.66393774 1.66770545
H  0.95231753 -1.45960626 -2.0526252
C  1.6438262 -1.63524503 1.99664588
H  2.1035342 -0.74067278 2.38937323
H  0.56967731 -1.68972169 1.89850604
H  2.25897363 -2.46065192 1.67193788
