program: Gaussian 16
title: Anthracene radical + methane
version: ES64L-G16RevC.01
method: UM062X
basis: 6-311++G(d,p)
operation: Freq
keyword: #P
keyword: Geom=AllCheck
keyword: Guess=TCheck
keyword: SCRF=Check
keyword: GenChk
keyword: UM062X/6-311++G(d,p)
keyword: Freq
converged: YES YES NO NO
polarizability: 3.17515599e+02 5.65911713e+01 2.43266793e+02 8.30757477e+00 -3.54959224e+00 1.10283084e+02
1716.lowfreq: -2.3856 -0.0003 0.0003 0.0004 7.3824 10.7446 17.1996 24.6695 31.1655
frequency: 16.7874 24.6291 31.0801 64.4608 85.6545 89.6198 121.0294 170.3510 231.8007 233.4467 266.6155 384.2519 391.6827 397.5484 477.4605 497.2889 505.4414 533.8519 582.3377 608.7738 631.4955 656.0931 740.0493 750.8727 767.2166 774.1416 779.9949 840.1859 867.0781 876.7869 903.6646 911.6841 927.3222 1000.7894 1002.6595 1017.0549 1017.6520 1031.0040 1034.7137 1134.2591 1154.9791 1169.3604 1185.3589 1198.1281 1237.8581 1274.3851 1300.8368 1332.2286 1334.5160 1335.6553 1337.0542 1358.0658 1401.3522 1413.9252 1435.5317 1482.4905 1495.5706 1520.0762 1553.4205 1556.1873 1599.7430 1603.2087 1651.2144 1701.9309 1702.2722 3052.2402 3165.3007 3169.2014 3171.7083 3193.8549 3196.9304 3197.3880 3205.0528 3207.0807 3216.5357 3217.8336 3227.4791 3227.9606
redmass: 3.6856 1.6324 1.5391 1.0203 3.8341 4.2673 3.6561 1.0283 4.8520 4.5692 4.1950 5.0058 3.6133 6.7228 2.8423 3.5334 3.1549 7.1412 3.5954 6.9442 7.2757 6.2730 4.7018 1.7623 2.1556 6.2166 1.3430 4.5943 1.3408 1.4324 5.8696 1.5132 6.2359 1.3275 1.3367 1.2890 1.2887 2.1989 2.3393 2.0479 1.3730 1.4004 1.0700 1.2842 1.5543 2.1002 2.8637 1.2942 1.8661 1.1800 1.2454 2.6159 3.3230 1.6734 9.7421 2.3150 3.1600 2.7752 1.0085 1.0078 6.4763 7.3351 6.3943 6.8077 6.1844 1.0079 1.1014 1.1017 1.1017 1.0908 1.0878 1.0882 1.0884 1.0880 1.0953 1.0951 1.0984 1.0986
irintensity: 0.1402 0.0162 0.0042 0.0138 1.1329 1.7386 0.0010 0.0018 0.0003 3.0071 0.3498 0.6227 2.1906 0.0334 0.0038 0.0052 26.0180 0.0233 0.0698 9.3096 0.0861 0.5336 0.0059 55.6423 88.8941 0.0472 0.0085 0.1325 14.3157 0.0088 3.4568 45.6802 0.1636 0.0187 3.0518 0.0154 0.0098 17.3724 0.4328 0.4057 0.0774 4.7056 1.5417 0.3176 0.0414 6.1153 0.2401 42.7559 4.9002 25.2236 14.6315 9.8785 3.2478 0.0238 0.0069 1.8071 2.8391 0.1761 3.3392 0.0608 10.7329 1.4442 1.6370 2.6783 3.2035 0.4101 14.7000 33.0678 19.5163 2.7511 0.4216 4.2880 0.8279 2.2341 14.6865 13.8594 24.5831 8.6758
temp: 403.150 k
press: 1.00000 atm
elementType: 6 6 6 6 6 6 6 6 6 6 6 1 6 6 6 1 1 1 1 1 1 1 1 1 6 1 1 1
symmnumber: 1
zpe: 599106.3 jmol-1
zpe.correction: 0.228188 hartree
zpe.thermalcorrener: 0.252624 hartree
zpe.thermalcorrenthalpy: 0.253901 hartree
zpe.thermalcorrgfe: 0.160047 hartree
zpe.sumelectzpe: -579.013674 hartree
zpe.sumelectthermal: -578.989238 hartree
zpe.sumelectthermalent: -578.987961 hartree
zpe.sumelectthermalfe: -579.081814 hartree
dipole: -0.3761 0.6751 -0.0862
dipole: 0.7776
quadrupole: -74.1952 -76.3205 -97.3245
quadrupole: 0.2527 1.2702 -1.0232
quadrupole: 8.4182 6.2929 -14.7111 0.2527 1.2702 -1.0232
hfenergy: -579.2418616 hartree
pointgroup: C01 [X(C15H13)]
dipole: -0.1479608 0.2656131 -0.0339087 debye
polarizability: 317.5155986|56.5911713|243.2667929|8.3075748|-3.5495922|110.2830837 unknown
InChI: InChI=1/C14H9.CH4/c1-2-6-12-10-14-8-4-3-7-13(14)9-11(12)5-1;/h1-9H;1H4
charge 0 multiplicity 2
28 atoms
C  -4.9461887 -0.72027905 -0.02219346
C  -3.58811684 -0.77198391 0.06163087
C  -2.81850639 0.4337018 0.03872853
C  -3.49207915 1.70330018 -0.07467021
C  -4.92038492 1.70203694 -0.15942638
C  -5.62056347 0.53386114 -0.13394829
C  -1.44299347 0.47801905 0.11837095
C  -2.73975271 2.88085762 -0.09885799
C  -1.34456497 2.86728937 -0.01682702
C  -0.65278418 1.60748374 0.09674108
C  0.77552468 1.59327777 0.17798116
H  1.27842135 0.63669041 0.26180855
C  1.47529803 2.7611049 0.14957602
C  0.79682195 4.01306776 0.0385662
C  -0.56195317 4.06482819 -0.04180627
H  -5.52730728 -1.63441863 -0.00465857
H  -3.06424464 -1.71709856 0.14662324
H  -5.43371661 2.65382559 -0.24487484
H  -6.70198164 0.54820045 -0.19905189
H  -3.2536655 3.83301279 -0.1848654
H  2.55683206 2.74836685 0.21116413
H  1.37671284 4.92807703 0.01824576
H  -1.07618605 5.01615351 -0.12661344
H  0.09506349 -1.92082985 0.84924047
C  0.52004335 -2.32584132 -0.06960308
H  1.60716698 -2.26147985 -0.02787354
H  0.22306657 -3.36831805 -0.18060873
H  0.15258334 -1.74878239 -0.91845444
