program: Gaussian 16
title: KOtBu tetramer + Ph radical
version: ES64L-G16RevC.01
method: UM062X
basis: 6-311++G(d,p)
operation: Freq
keyword: #P
keyword: Geom=AllCheck
keyword: Guess=TCheck
keyword: SCRF=Check
keyword: GenChk
keyword: UM062X/6-311++G(d,p)
keyword: Freq
converged: YES YES YES YES
polarizability: 3.60046281e+02 -3.90328699e+00 4.61078301e+02 -9.98102933e+00 -3.00648673e+01 4.06475745e+02
1716.lowfreq: -1404.9477 -4.9155 -0.9719 -0.0017 -0.0011 0.0018 5.3658 9.4000 10.0806
frequency: -1404.9477 9.0261 9.9188 19.9537 21.9361 24.1089 24.2991 26.2594 27.3927 29.7090 36.2520 37.1908 38.8570 49.4418 53.7515 54.7640 62.4522 70.1902 70.5745 89.1973 92.7120 99.3237 110.2672 130.2565 144.8542 161.1936 162.6034 163.3618 164.8425 167.9399 172.0549 173.6329 175.9577 183.5171 186.3619 188.5705 256.4439 257.6502 261.0035 280.1156 284.3191 314.4395 314.9126 316.3223 318.5754 319.6553 319.7582 327.2733 352.2930 352.8801 353.8369 354.7421 356.0768 356.5965 357.1578 382.4273 396.5792 425.7527 437.3774 437.7818 438.9153 472.2636 477.0177 486.8092 488.1661 488.6299 491.0266 491.2089 492.1528 497.2059 567.4882 616.2695 683.1065 700.0670 733.2428 757.1893 757.8492 757.9982 761.9995 864.2889 886.5859 886.6946 887.1535 887.2312 887.4796 887.6166 891.7717 914.1524 928.8628 931.7616 932.7344 933.0230 936.0633 997.6185 1007.3146 1010.4073 1010.6831 1013.0477 1016.8774 1019.3004 1028.4336 1028.7220 1028.8231 1028.9848 1029.1489 1029.3045 1030.0557 1030.5708 1043.0669 1080.4399 1084.7164 1169.9369 1182.3425 1232.5869 1235.9768 1239.6628 1239.7855 1240.0248 1240.2192 1240.5389 1240.8307 1245.4846 1249.5858 1249.7301 1261.8337 1307.3175 1309.7379 1317.3031 1368.4254 1368.8569 1369.3295 1369.7647 1369.9932 1370.3491 1370.8715 1384.5488 1390.9132 1391.4263 1391.8381 1398.3812 1438.2511 1473.5705 1473.7218 1473.9538 1478.8768 1480.1134 1481.9106 1482.0811 1482.2818 1482.5050 1483.0486 1483.5548 1487.3111 1494.1548 1494.2674 1494.3565 1494.9215 1495.0269 1495.4679 1496.0201 1499.9088 1503.8437 1509.9424 1510.3649 1511.0210 1624.9032 1653.9418 3023.3279 3024.1866 3024.2183 3024.4783 3024.7920 3024.8794 3024.9989 3029.9862 3032.9474 3033.4461 3033.5369 3053.6010 3095.8815 3096.7055 3096.9574 3098.1992 3099.8139 3100.4644 3100.5920 3100.6141 3100.7643 3100.8661 3101.5705 3103.1795 3103.3327 3103.3934 3103.5714 3103.7666 3104.2388 3107.8493 3111.4450 3111.7463 3112.2434 3112.8279 3128.6635 3183.2838 3184.8736 3199.2511 3205.3766 3220.6755
redmass: 1.1118 4.8447 4.8282 3.5813 3.6086 3.5749 2.8929 3.1624 2.9938 3.1147 3.6843 3.2138 4.2501 5.6162 4.9963 5.1648 6.8722 7.8701 7.8993 7.1245 6.9238 6.0617 3.3689 5.1999 11.5886 7.9473 8.3540 7.8615 8.2319 8.6591 11.1840 11.3468 16.3450 6.8501 6.4313 6.2899 1.0097 1.0123 1.0097 1.5140 1.5448 1.0517 1.0529 1.0534 1.0546 1.0625 1.0606 1.2717 2.1880 2.3355 2.3388 2.3045 2.3711 2.3399 2.3251 2.5283 2.7954 3.3672 2.2089 2.2121 2.2211 2.5788 2.5659 3.0487 3.0544 3.0714 3.1089 3.1109 3.1549 3.1821 1.3235 5.1542 5.0084 2.8601 1.2900 3.3460 3.3563 3.3511 3.3102 1.2467 1.6705 1.6699 1.6687 1.6679 1.6648 1.6679 1.6402 1.5295 1.5248 1.1972 1.1980 1.1973 1.1756 1.3919 3.4466 2.3212 2.3218 2.4306 2.1677 1.4161 1.3920 1.3916 1.3740 1.3929 1.3912 1.3907 1.3917 1.5458 2.5883 2.1468 1.5527 1.1476 1.1302 3.1711 2.5391 2.7195 2.7217 2.7106 2.7157 2.7145 2.7100 2.6460 3.7434 3.7439 3.8805 2.0353 1.2788 2.1097 1.3327 1.3311 1.3316 1.3296 1.3296 1.3294 1.3356 1.2657 1.2535 1.2527 1.2539 1.1197 1.1101 1.0504 1.0506 1.0504 1.2849 1.4329 1.0467 1.0467 1.0467 1.0471 1.0464 1.0464 1.0728 1.0611 1.0612 1.0680 1.0610 1.0611 1.0604 1.0604 2.0405 1.0729 1.0543 1.0542 1.0543 5.5033 6.3107 1.0339 1.0338 1.0339 1.0339 1.0339 1.0338 1.0341 1.0351 1.0349 1.0348 1.0349 1.0534 1.1039 1.1039 1.1039 1.1034 1.1020 1.1019 1.1018 1.1019 1.1019 1.1018 1.1019 1.1022 1.1022 1.1022 1.1022 1.1021 1.1022 1.1019 1.1009 1.1009 1.1008 1.1012 1.1088 1.0873 1.0877 1.0905 1.0943 1.0979
irintensity: 734.3311 0.0034 0.0032 0.0047 0.0166 0.0057 0.0020 0.0079 0.0042 0.0073 0.0172 0.0069 0.2802 0.4882 0.0104 0.0237 0.5269 1.1485 1.4472 0.1123 0.0340 0.4050 0.0011 5.1967 8.6782 1.0905 1.0760 0.1551 0.7279 24.3617 31.1949 34.8549 3.2290 85.7387 106.4585 104.0007 0.0138 0.1742 0.0144 11.0236 11.3211 0.0619 0.0141 0.0345 0.0577 0.1363 0.1425 4.8218 1.7421 2.8117 0.2026 0.6235 17.0377 22.9707 25.6669 1.5484 0.0061 10.5191 17.7259 15.6550 6.6294 17.5721 13.4786 7.8134 1.0877 1.3372 34.8089 48.5291 81.6543 72.5338 4.5401 0.0023 2.2034 17.7031 107.8042 1.9295 1.9214 1.6110 9.8613 0.0552 1.3111 1.9442 1.5947 1.4368 1.6148 1.7445 1.7530 1.2053 11.8428 0.0038 0.0006 0.0101 0.0533 0.0379 111.1177 137.2420 134.4879 44.3375 30.9774 11.9275 0.4872 0.5440 1.2820 0.7226 0.3193 1.3712 0.8843 12.6290 0.6621 16.3808 9.8481 0.0021 1.0032 188.7467 87.6151 3.9651 11.4584 13.3902 43.0785 48.5053 33.9970 16.1890 303.7351 304.2159 37.0489 0.1027 21.2976 0.0788 12.9899 37.7238 30.8990 5.5023 25.4259 61.3460 38.9463 15.0350 14.0487 14.9078 6.0878 0.7623 1.7229 0.0122 0.0061 0.0100 2.0653 5.5832 0.4901 0.4918 0.5421 3.2988 3.1597 2.2235 0.7352 3.3488 4.7194 6.2579 3.1740 7.8877 7.0128 5.5334 12.1111 0.4181 4.2694 4.2294 2.5225 19.9804 0.7438 55.7607 60.8971 42.8567 65.8079 39.8760 86.3660 70.1372 30.0373 2.3753 3.2061 3.3886 33.5964 3.3994 0.5339 2.4886 19.6021 55.2793 32.5281 38.9795 36.9921 35.6064 21.3923 57.9744 13.0557 47.9032 15.7024 53.4133 70.1088 44.8602 5.8232 203.0331 201.5533 134.1526 49.5998 39.5454 0.4314 4.2656 1.2439 25.8629 22.5595
temp: 403.150 k
press: 1.00000 atm
elementType: 19 8 8 19 8 8 19 19 6 6 1 1 1 6 1 1 1 6 1 1 1 6 6 1 1 1 6 1 1 1 6 1 1 1 6 6 1 1 1 6 1 1 1 6 1 1 1 6 6 1 1 1 6 1 1 1 6 1 1 1 6 6 6 6 6 6 1 1 1 1 1
symmnumber: 1
zpe: 1529256.4 jmol-1
zpe.correction: 0.582463 hartree
zpe.thermalcorrener: 0.654588 hartree
zpe.thermalcorrenthalpy: 0.655865 hartree
zpe.thermalcorrgfe: 0.444657 hartree
zpe.sumelectzpe: -3563.053974 hartree
zpe.sumelectthermal: -3562.981849 hartree
zpe.sumelectthermalent: -3562.980572 hartree
zpe.sumelectthermalfe: -3563.191780 hartree
dipole: 0.1834 0.6898 -0.2455
dipole: 0.7548
quadrupole: -223.2697 -220.3019 -215.7765
quadrupole: -4.0078 -0.9438 1.7018
quadrupole: -3.4870 -0.5192 4.0062 -4.0078 -0.9438 1.7018
hfenergy: -3563.6364368 hartree
pointgroup: C01 [X(C22H41K4O4)]
dipole: 0.0721687 0.2713963 -0.0966028 debye
polarizability: 360.0462811|-3.903287|461.0783011|-9.9810293|-30.0648673|406.4757448 unknown
InChI: InChI=1/C10H14O.3C4H9O.4K/c1-10(2,11)8-12-9-6-4-3-5-7-9;3*1-4(2,3)5;;;;/h3-7H,8H2,1-2H3;3*1-3H3;;;;/rC22H41K4O4/c1-19(2,3)27-23-24(27)25(23,27)26(23,24,28(23,24)20(4,5)6,29(23,25)21(7,8)9)30(24,25)22(10,11)17-31-18-15-13-12-14-16-18/h12-16H,17H2,1-11H3
charge 0 multiplicity 2
71 atoms
K  -3.63037597 -0.64528699 -0.17771556
O  -3.27292678 1.63652778 0.96742533
O  -2.26474679 0.15016291 -2.21771062
K  -1.91292756 2.43702671 -1.07227561
O  0.25330569 1.55548071 0.01791788
O  -1.4608217 -1.53615585 0.91718257
K  -0.09833387 -0.72373059 -1.12975966
K  -1.10705016 0.75290801 2.05826207
C  -2.63031246 -0.03661042 -3.53661216
C  -2.80337251 1.31991649 -4.24868211
H  -1.86089575 1.87679822 -4.21212848
H  -3.09510428 1.21301869 -5.29835169
H  -3.57488826 1.90678676 -3.73860236
C  -3.9639561 -0.80499646 -3.62570107
H  -4.286692 -0.97525147 -4.65774316
H  -3.85953251 -1.77920429 -3.13600266
H  -4.74896175 -0.23918756 -3.11237739
C  -1.55353676 -0.84480291 -4.28782183
H  -1.42606349 -1.82126765 -3.80820452
H  -1.80635142 -1.01244715 -5.33962166
H  -0.59872605 -0.30959457 -4.24774895
C  -1.31033575 -2.76982918 1.52178409
C  -2.6334301 -3.53850027 1.4358662
H  -3.44332402 -3.0535624 1.98940107
H  -2.92986801 -3.75837695 0.40564549
H  -2.50485745 -4.66494947 1.97889529
C  -0.2173637 -3.59673583 0.81917791
H  0.73563111 -3.05913316 0.86700385
H  -0.07868685 -4.58155713 1.27634786
H  -0.48507327 -3.74082722 -0.23333706
C  -0.93051855 -2.61265908 3.00597589
H  -0.81203487 -3.57616302 3.51181719
H  0.01445419 -2.06487513 3.08632177
H  -1.70884965 -2.04391419 3.52628623
C  -4.24345666 2.35433128 1.63877911
C  -3.83961399 2.5664894 3.11174391
H  -2.88868377 3.10833346 3.15743183
H  -4.58383884 3.13676897 3.67665577
H  -3.71206878 1.59515793 3.60206522
C  -5.59015645 1.60421119 1.60939423
H  -5.90609109 1.45612972 0.57116864
H  -5.47383407 0.62262414 2.08149857
H  -6.38606558 2.14230284 2.13408353
C  -4.44236468 3.73694197 0.98667424
H  -3.49895225 4.29286694 1.01130505
H  -4.7440356 3.60993487 -0.05850442
H  -5.20560423 4.3376379 1.49165342
C  1.44816324 2.24405422 0.09516179
C  2.56594241 1.47364758 -0.63539624
H  3.53001767 1.99096439 -0.59967898
H  2.69185083 0.48665678 -0.17745003
H  2.29031711 1.33722515 -1.68660869
C  1.31413857 3.63635514 -0.55333815
H  0.53133692 4.20576268 -0.0407496
H  2.24192739 4.21556543 -0.50829757
H  1.03199689 3.52608636 -1.60593393
C  1.87063888 2.43306262 1.56598516
H  1.09865845 2.99691708 2.10098196
H  1.98225286 1.45399648 2.04438594
H  2.81769741 2.97229426 1.66881214
C  -2.32375347 -5.95238597 2.60670393
C  -1.89679239 -7.01530215 1.83068746
C  -2.58133714 -6.07604843 3.96046161
C  -1.71974423 -8.25880903 2.44100576
C  -2.40175201 -7.32305072 4.56295891
C  -1.9722036 -8.4090525 3.80304977
H  -2.91382021 -5.22435828 4.54577806
H  -2.59619686 -7.44582607 5.62279946
H  -1.8333683 -9.37521141 4.27381194
H  -1.38486946 -9.10746331 1.85467781
H  -1.70007509 -6.88908194 0.7705297
