program: Gaussian 16
title: Ph radical + CH4 scan for TS - 7 as ts
version: ES64L-G16RevC.01
method: UM062X
basis: 6-311++G(d,p)
operation: Freq
keyword: #P
keyword: Geom=AllCheck
keyword: Guess=TCheck
keyword: SCRF=Check
keyword: GenChk
keyword: UM062X/6-311++G(d,p)
keyword: Freq
converged: YES YES NO NO
polarizability: 1.14758182e+02 1.66408440e+01 1.32109022e+02 -2.94456183e+00 3.70592569e+00 6.16618495e+01
1716.lowfreq: -1455.9440 -5.8601 -3.4230 -0.0005 0.0004 0.0005 16.1670 18.8902 72.6578
frequency: -1455.9440 18.5823 72.5927 83.6782 365.7598 397.6356 399.9257 499.6229 517.0507 614.8069 673.5093 699.2913 741.8811 865.3917 927.8752 1003.1403 1008.6107 1022.3550 1039.1812 1075.1477 1086.5711 1170.7231 1185.2078 1192.6634 1265.6793 1294.8398 1317.8370 1363.0960 1445.2541 1450.7468 1487.0466 1503.5974 1627.9208 1656.6260 3086.3034 3190.2336 3192.9533 3203.7481 3208.9257 3215.1522 3219.3895 3222.8658
redmass: 1.0912 1.0355 3.0408 3.3667 4.2032 2.0340 2.6573 1.4739 1.1483 5.8703 5.9806 2.7710 1.3059 1.2473 1.3105 1.3908 6.3346 1.2946 4.0465 1.9244 1.5616 1.1490 1.1306 1.1823 1.0997 1.4890 2.9258 1.1947 1.0490 1.1426 1.7719 2.1431 5.5159 6.2642 1.0212 1.0865 1.0875 1.0917 1.0949 1.1094 1.1097 1.0981
irintensity: 193.8831 0.0018 0.1157 1.2841 2.8436 0.9895 0.1339 7.8291 0.6780 0.1485 0.5940 20.2169 107.4797 0.0012 1.6816 0.0041 9.4199 0.0174 6.9693 1.2298 9.6379 0.0001 0.2886 0.7063 7.5554 0.8970 0.0145 2.7988 5.0263 9.0868 4.6771 14.7376 16.5246 0.8267 4.2610 0.7274 1.3210 0.0764 23.6668 9.3298 9.5044 15.4106
temp: 403.150 k
press: 1.00000 atm
elementType: 6 6 6 6 6 6 1 1 1 1 1 1 6 1 1 1
symmnumber: 1
zpe: 338623.4 jmol-1
zpe.correction: 0.128975 hartree
zpe.thermalcorrener: 0.141846 hartree
zpe.thermalcorrenthalpy: 0.143123 hartree
zpe.thermalcorrgfe: 0.078887 hartree
zpe.sumelectzpe: -271.864112 hartree
zpe.sumelectthermal: -271.851240 hartree
zpe.sumelectthermalent: -271.849964 hartree
zpe.sumelectthermalfe: -271.914200 hartree
dipole: -0.0818 -0.1363 -0.0059
dipole: 0.1591
quadrupole: -39.1245 -39.4581 -47.9658
quadrupole: -0.6709 -0.7505 0.6395
quadrupole: 3.0583 2.7247 -5.7830 -0.6709 -0.7505 0.6395
hfenergy: -271.9930864 hartree
pointgroup: C01 [X(C7H9)]
dipole: -0.0321967 -0.0536252 -0.0023393 debye
dipolederiv: -0.0758192 0.0570535 -0.0026567 0.0569338 -0.0170789 0.0058685 -0.0028591 0.0048166 -0.1625463 0.073772 0.066483 -0.0139286 -0.0471941 0.037439 0.0177337 -0.0219936 0.0081499 -0.1594462 -0.0722638 -0.2491987 -0.0216672 -0.1170491 -0.2512056 0.0019298 -0.0123645 0.0106444 -0.1422563 0.1867107 0.3559885 0.0012443 0.3541858 0.5605819 0.0187692 0.0024355 0.0218754 -0.1098836 -0.0607896 -0.1094673 -0.0144808 -0.2397131 -0.2679957 0.0107604 -0.0229704 -0.0013326 -0.1419501 0.0411113 -0.0654656 -0.0198389 0.0487651 0.0753609 0.0128359 -0.0119189 0.0211805 -0.1597448 0.0372962 -0.0785582 0.0043009 -0.0788263 -0.0462989 -0.0087639 0.0045899 -0.0079711 0.1638803 0.0322712 0.0489136 0.0135618 0.0549126 -0.0858255 -0.0216061 0.013231 -0.0198978 0.1577509 -0.0717261 0.0244064 0.0192897 -0.0041271 0.0993114 -0.0039588 0.0180124 -0.0056209 0.1590053 0.054369 0.0602756 0.0126506 0.0886295 -0.0227433 -0.0199207 0.0139125 -0.0159188 0.1580626 -0.1076084 -0.0174179 0.0192129 -0.0233865 0.0492632 -0.0058522 0.0189781 -0.0062953 0.1585781 -0.0725394 -0.1905807 -0.0008832 -0.1884398 -0.2772303 -0.0082717 -0.0023911 -0.0106348 0.0757995 0.066082 0.1419453 0.0069476 0.1500641 0.2239865 0.0068433 0.0035693 0.0017086 -0.0001082 -0.0087794 -0.0345599 0.0761186 -0.0415964 -0.0028122 -0.0172042 0.0706898 -0.017885 -0.0242903 -0.0384358 0.0321688 -0.0137014 0.0360036 -0.0703762 0.0069538 -0.0116282 0.0069927 0.0785134 0.0163494 -0.0419864 -0.0661696 -0.0491621 -0.0043763 0.003883 -0.0592927 0.0101882 -0.0513644 unknown
polarizability: 114.7581821|16.640844|132.1090218|-2.9445618|3.7059257|61.6618495 unknown
InChI: InChI=1/C7H9/c1-8-7-5-3-2-4-6-7/h2-6H,1H3
charge 0 multiplicity 2
16 atoms
C  0.61511365 -1.31088112 -0.04802098
C  2.00374899 -1.33572556 -0.15726762
C  2.72852374 -0.14284127 -0.1300607
C  2.03398698 1.04550454 0.0069548
C  0.65628497 1.09919912 0.11710585
C  -0.0590071 -0.09943603 0.08882014
H  0.05621697 -2.23895907 -0.06984417
H  2.52294198 -2.28164384 -0.26364597
H  3.81000484 -0.15242478 -0.21454103
H  0.13994755 2.04737416 0.22313501
H  -1.13990037 -0.08629796 0.1732279
H  2.74638867 2.23014479 0.03436672
C  3.40132497 3.33968414 0.05466021
H  4.07694925 3.29294699 -0.79581127
H  2.64721198 4.11715576 -0.04149135
H  3.91578492 3.35859215 1.0121035
