program: Gaussian 16
title: KOtBu tetramer as radical cation
version: ES64L-G16RevC.01
method: UM062X
basis: 6-311++G(d,p)
operation: Freq
keyword: #P
keyword: Geom=AllCheck
keyword: Guess=TCheck
keyword: SCRF=Check
keyword: GenChk
keyword: UM062X/6-311++G(d,p)
keyword: Freq
converged: YES YES YES YES
polarizability: 3.22076137e+02 -4.03901652e+01 3.67821393e+02 -1.98986493e+00 -1.41548612e+00 2.99771552e+02
1716.lowfreq: -6.0931 -0.5391 -0.0023 -0.0011 0.0017 9.8165 25.0282 26.4023 28.3392
frequency: 24.9410 26.2992 28.3275 32.3054 35.4378 39.2152 48.1007 50.6382 57.3282 62.2706 67.4435 69.5974 76.0649 82.4507 85.3091 89.9261 95.3079 105.0755 111.4551 115.9418 121.8512 145.9066 168.6238 169.9310 183.1880 188.5277 196.9747 198.1455 214.8780 218.3105 236.1697 266.5102 269.0791 269.2506 292.1088 319.8932 321.3739 322.7449 323.6005 329.1748 334.0472 342.2854 343.0753 352.5977 355.3799 357.8177 360.6217 364.6784 367.2821 368.7566 423.7111 441.9875 442.5300 443.8176 447.4222 479.4240 485.6496 490.6660 491.8857 494.5622 496.9487 498.8846 757.6578 760.4437 760.6184 761.0393 880.1040 893.9774 894.3280 894.6706 894.9071 895.4956 896.6666 929.0126 933.3902 934.1941 935.7026 936.1877 963.9850 989.1429 1004.7671 1006.9194 1020.2288 1027.1328 1028.9866 1030.0180 1030.6464 1031.5518 1032.0481 1041.5460 1165.1476 1230.5815 1238.1529 1244.0966 1245.3338 1245.8697 1246.3892 1246.7891 1246.9678 1247.1673 1253.6934 1263.8950 1375.1614 1375.7181 1376.0257 1376.2514 1376.5560 1378.0426 1379.1438 1387.3607 1397.2756 1398.2176 1401.0833 1412.3754 1469.7097 1476.5342 1477.7353 1478.2019 1478.9900 1483.6598 1484.3654 1484.6438 1484.9371 1486.2291 1488.0290 1490.6042 1493.4143 1498.2676 1498.7811 1499.5566 1499.9826 1500.5265 1502.0616 1504.4213 1512.7787 1513.8232 1515.9917 1522.9809 3024.5151 3025.2474 3026.1197 3026.8684 3028.0589 3032.4178 3034.2993 3034.7579 3039.9422 3056.4202 3059.8381 3068.4570 3094.0277 3094.9372 3097.7499 3098.1151 3099.0437 3099.7577 3101.0363 3103.3116 3106.7047 3111.1394 3111.5028 3111.9945 3112.1913 3115.2073 3118.6738 3120.0703 3120.4945 3125.5331 3136.9914 3138.9107 3144.8256 3149.7313 3155.2775 3161.1974
redmass: 3.1100 3.4579 3.5888 2.8357 3.3940 3.3778 4.2807 4.1979 5.3425 6.8323 4.6079 6.6810 5.3210 5.0482 6.0123 5.9566 6.7003 8.3329 4.7298 6.8672 7.9474 7.4112 9.8908 9.8973 9.4275 9.1066 6.8627 5.7021 5.2957 5.3930 1.0560 1.0109 1.0231 1.0285 1.1093 1.0778 1.0524 1.1026 1.0548 1.0659 1.1015 2.2414 1.2374 2.0991 2.3603 2.3611 2.4070 2.1613 2.2827 1.8573 2.3451 2.2122 2.2223 2.2363 2.8406 3.2560 3.1058 3.1299 3.1935 3.1890 3.2824 3.3406 3.4294 3.4689 3.4749 3.3811 3.6395 1.6656 1.6610 1.6571 1.6570 1.6558 1.6556 1.5497 1.4990 1.2028 1.1991 1.1980 1.1966 2.3947 2.3818 2.3463 1.5030 1.3949 1.3882 1.3922 1.3935 1.3891 1.3902 1.4000 2.0644 3.3407 2.8050 2.7324 2.8158 3.1526 2.8722 2.8193 2.7587 2.7560 3.5504 2.9393 1.3373 1.3386 1.2982 1.3090 1.3360 1.2990 1.2999 1.3031 1.2536 1.2539 1.2472 1.2353 1.0504 1.0501 1.0498 1.0500 1.0481 1.0466 1.0470 1.0458 1.0468 1.0455 1.0469 1.0486 1.0523 1.0603 1.0605 1.0566 1.0604 1.0602 1.0521 1.0576 1.0545 1.0542 1.0528 1.0569 1.0355 1.0354 1.0351 1.0349 1.0360 1.0353 1.0362 1.0361 1.0368 1.0350 1.0359 1.0324 1.1037 1.1036 1.1030 1.1020 1.1020 1.1019 1.1019 1.1019 1.0998 1.1012 1.1012 1.1009 1.1009 1.1008 1.1010 1.0999 1.0998 1.1010 1.1040 1.1035 1.1017 1.1015 1.1030 1.1053
irintensity: 0.5985 1.3313 0.2419 0.3245 1.2002 0.3247 5.0953 3.0221 0.4250 7.5373 1.5147 1.8244 0.2419 0.3366 2.7406 3.1562 0.8133 2.2571 5.5935 4.8084 10.4948 18.3815 15.1407 18.2519 17.9788 40.1837 53.9975 26.9158 38.2487 63.6253 0.9918 0.0373 0.4286 0.8259 0.5603 0.8391 0.1313 0.7133 0.1737 0.2642 0.8242 7.4022 1.7715 3.5068 1.0293 12.2049 6.0588 9.9298 14.2262 11.4188 13.6523 14.9102 12.7910 2.8753 14.6280 7.8922 10.9613 0.8831 19.0929 39.6962 50.8694 47.5641 4.1227 5.3662 1.8061 2.3267 48.1088 0.6915 0.8915 0.8385 0.8657 0.8123 0.8576 0.5626 6.7678 0.0308 0.0031 0.0093 0.0603 75.6232 103.2190 100.5083 6.9141 10.2387 1.8837 0.7639 0.7919 0.9571 0.8352 0.9252 76.0737 385.1163 4.3085 23.6350 23.0521 135.5741 97.9359 10.5706 19.0267 42.2097 234.7971 24.4530 19.5571 14.1552 19.2370 40.1253 25.9983 35.3737 34.7306 16.3368 12.4306 12.5952 3.6254 7.2056 1.4789 1.1047 0.1385 0.0558 1.1957 1.1719 0.9883 1.8942 0.4200 6.2130 6.7506 3.6918 5.8346 4.1610 5.2141 8.4039 6.4898 5.8706 14.8957 7.0528 3.8789 5.6262 2.6413 15.0401 5.4520 93.1003 58.7511 60.7079 62.8079 58.2688 0.5298 1.8269 16.1598 30.4352 1.8821 16.8269 3.2341 8.7669 24.6190 76.0896 72.3169 20.4908 92.7796 44.1891 54.3135 9.4046 5.3266 4.1159 9.1346 9.3337 40.3383 115.5597 131.9656 118.2033 11.9153 12.0676 1.5166 13.9112 11.4761 17.2277
temp: 403.150 k
press: 1.00000 atm
elementType: 19 8 8 19 8 8 19 19 6 6 1 1 1 6 1 1 1 6 1 1 1 6 6 1 1 1 6 1 1 1 6 1 1 1 6 6 1 1 1 6 1 1 1 6 1 1 1 6 6 1 1 1 6 1 1 1 6 1 1 1
symmnumber: 1
zpe: 1316179.1 jmol-1
zpe.correction: 0.501306 hartree
zpe.thermalcorrener: 0.563110 hartree
zpe.thermalcorrenthalpy: 0.564386 hartree
zpe.thermalcorrgfe: 0.385133 hartree
zpe.sumelectzpe: -3331.413678 hartree
zpe.sumelectthermal: -3331.351874 hartree
zpe.sumelectthermalent: -3331.350597 hartree
zpe.sumelectthermalfe: -3331.529851 hartree
dipole: -8.2367 -2.7398 3.5601
dipole: 9.3821
quadrupole: -144.6106 -148.2224 -158.6569
quadrupole: 1.5362 -1.6017 -2.5851
quadrupole: 5.8860 2.2743 -8.1603 1.5362 -1.6017 -2.5851
hfenergy: -3331.9149838 hartree
pointgroup: C01 [X(C16H36K4O4)]
dipole: -0.1558549 -2.1310039 1.6967612 debye
polarizability: 322.0761366|-40.3901652|367.8213927|-1.9898649|-1.4154861|299.7715519 unknown
InChI: InChI=1/4C4H9O.4K/c4*1-4(2,3)5;;;;/h4*1-3H3;;;;/rC16H36K4O4/c1-13(2,3)21-17-20-18(21,22(17,20)14(4,5)6)24(20,16(10,11)12)19(20,21)23(17,20)15(7,8)9/h1-12H3
charge 1 multiplicity 2
60 atoms
K  -3.73354925 -0.71918131 -0.66276325
O  -3.01658867 1.04344885 1.07107852
O  -2.13757938 0.22682952 -2.35517278
K  -2.01870672 2.42818059 -1.0065121
O  0.33235365 1.7337948 -0.19005709
O  -1.49045872 -1.256922 0.91944282
K  0.07659788 -0.51455311 -1.35120153
K  -0.64045408 1.19389874 2.05700706
C  -2.32818097 0.22510888 -3.73131638
C  -2.48532991 1.6648831 -4.25343553
H  -1.58581934 2.24465643 -4.01833913
H  -2.63684058 1.70425558 -5.33596067
H  -3.34769165 2.1424706 -3.77561766
C  -3.59459207 -0.57020615 -4.09686987
H  -3.77694609 -0.59881165 -5.17498001
H  -3.49974481 -1.60205728 -3.74182809
H  -4.4695343 -0.11415214 -3.62055166
C  -1.12387661 -0.41841621 -4.44348936
H  -0.98681652 -1.44589258 -4.0887381
H  -1.24817255 -0.45177398 -5.52953284
H  -0.21435036 0.15510698 -4.23092271
C  -1.70610557 -2.22761041 1.89225773
C  -3.17941599 -2.63633159 1.93463432
H  -3.79459953 -1.76103471 2.15867848
H  -3.48958935 -3.07406973 0.98246237
H  -3.3440511 -3.38230919 2.71402953
C  -0.83802962 -3.41218263 1.39223596
H  0.21526717 -3.13047309 1.36042213
H  -0.96233495 -4.23834318 2.09513647
H  -1.16267695 -3.73584985 0.4026862
C  -1.21624031 -1.76689613 3.26515011
H  -1.3141507 -2.57236197 3.99503838
H  -0.16207771 -1.48135073 3.2201613
H  -1.81628425 -0.9243893 3.61849857
C  -4.04262393 1.59369134 1.83544108
C  -3.83964038 1.30629236 3.33429177
H  -2.90253178 1.74731312 3.69151986
H  -4.64656289 1.7206157 3.94510451
H  -3.80452056 0.22638531 3.50401255
C  -5.41183122 1.02070123 1.42333222
H  -5.60470648 1.22824524 0.36482234
H  -5.43607832 -0.06291002 1.58534114
H  -6.23289316 1.45614072 1.99902097
C  -4.08113913 3.12149514 1.63484316
H  -3.10640776 3.55415112 1.88422037
H  -4.31269628 3.35950515 0.59135128
H  -4.83815533 3.60340251 2.25999239
C  1.44690087 2.52855448 -0.42796129
C  2.46324851 1.78265134 -1.31219518
H  3.35830364 2.37743791 -1.51492618
H  2.77938466 0.85731976 -0.81803069
H  2.0050337 1.53229345 -2.2758528
C  1.03759481 3.82539227 -1.14972443
H  0.32230445 4.38293251 -0.53527327
H  1.89016682 4.480458 -1.35058831
H  0.56601007 3.58430805 -2.10886206
C  2.13316175 2.90168134 0.89841061
H  1.43706562 3.46256298 1.5317967
H  2.43390893 1.9914406 1.42817426
H  3.02407129 3.51914524 0.7519848
