program: Gaussian 16
title: p-benzyne open shell singlet
version: ES64L-G16RevC.01
method: UM062X
basis: 6-311++G(d,p)
operation: Freq
keyword: #P
keyword: Geom=AllCheck
keyword: Guess=TCheck
keyword: SCRF=Check
keyword: GenChk
keyword: UM062X/6-311++G(d,p)Freq
converged: YES YES YES YES
polarizability: 8.84011280e+01 -2.39881966e+00 8.58618583e+01 1.39378603e-02 -2.09248948e-02 4.52327806e+01
1716.lowfreq: -18.0635 -13.4034 -0.0005 -0.0004 -0.0003 22.7512 406.7098 442.7495 580.5650
frequency: 406.7098 442.7495 580.5648 619.0171 647.8353 768.6424 784.7418 935.1950 946.3963 969.5672 1038.0481 1051.5488 1069.1044 1153.3470 1259.3208 1280.0470 1387.7044 1461.6819 1471.3930 1668.5449 3205.7352 3206.5424 3218.7966 3220.7858
redmass: 2.8820 3.5474 6.7573 7.5432 4.1237 1.3416 1.2454 1.3248 7.4212 1.3723 6.9070 1.6695 1.5857 1.1412 2.6820 1.2117 5.4135 2.2194 5.9469 8.5207 1.0878 1.0860 1.0940 1.0956
irintensity: 0.0180 24.2651 0.0000 0.0000 0.0000 113.8846 0.0000 0.0000 4.7382 0.0232 0.0000 24.7869 8.2561 0.0000 2.7123 0.0000 2.9282 7.8379 0.0000 0.0000 0.1390 0.0000 0.7011 0.0000
temp: 403.150 k
press: 1.00000 atm
elementType: 6 6 6 6 6 6 1 1 1 1
symmnumber: 1
zpe: 196151.8 jmol-1
zpe.correction: 0.074710 hartree
zpe.thermalcorrener: 0.082303 hartree
zpe.thermalcorrenthalpy: 0.083580 hartree
zpe.thermalcorrgfe: 0.035420 hartree
zpe.sumelectzpe: -230.755477 hartree
zpe.sumelectthermal: -230.747885 hartree
zpe.sumelectthermalent: -230.746608 hartree
zpe.sumelectthermalfe: -230.794768 hartree
dipole: -0.0000 0.0000 -0.0000
dipole: 0.0000
quadrupole: -29.5694 -34.0322 -38.8632
quadrupole: -3.8654 0.0047 -0.0036
quadrupole: 4.5856 0.1227 -4.7083 -3.8654 0.0047 -0.0036
hfenergy: -230.8301877 hartree
pointgroup: C01 [X(C6H4)]
dipole: -0.0000004 0.0000002 -0.0000001 debye
dipolederiv: -0.0902379 -0.0404267 0.0000206 -0.0415513 -0.1392196 0.0000195 0.0000225 0.000025 -0.0707417 0.0186284 -0.0014214 0.000047 -0.0018583 0.0012758 -0.000063 0.0000696 -0.0000919 -0.1479722 0.0079443 -0.0091473 0.0000591 -0.0074324 0.0117527 -0.0000835 0.0000127 -0.0000772 -0.1482339 -0.090238 -0.0404259 0.0000161 -0.0415523 -0.1392194 0.0000221 0.0000171 0.0000289 -0.0707417 0.0186255 -0.0014209 0.0000531 -0.0018582 0.0012759 -0.0000829 0.0000353 -0.0000536 -0.1479733 0.0079435 -0.0091461 0.0000392 -0.0074308 0.0117506 -0.0000878 0.000064 -0.0000872 -0.1482349 0.0799487 0.049015 -0.0000581 0.0547958 0.0170839 0.0001057 -0.0000451 0.0000818 0.1834966 -0.0162816 0.0019793 -0.0000561 -0.0039539 0.1091082 0.000038 -0.0000691 0.0000399 0.1834527 -0.0162816 0.0019795 -0.0000627 -0.0039546 0.1091081 0.0000341 -0.0000413 0.0000322 0.1834523 0.0799488 0.0490144 -0.0000583 0.0547961 0.0170837 0.000098 -0.0000657 0.000102 0.1834962 unknown
polarizability: 88.401128|-2.3988197|85.8618583|0.0139379|-0.0209249|45.2327806 unknown
InChI: InChI=1/C6H4/c1-2-4-6-5-3-1/h1-2,5-6H
charge 0 multiplicity 1
10 atoms
C  -0.592312 0.96789201 -0.00023929
C  0.77811857 0.90231857 0.00017059
C  1.48379328 2.12454513 -0.0001598
C  0.74186648 3.27865478 -0.00098736
C  -0.62856125 3.34422845 -0.00146214
C  -1.33423763 2.12199911 -0.00100149
H  -1.16962344 4.28327004 -0.00209696
H  -2.41801142 2.12114413 -0.00131998
H  2.56756691 2.1254054 0.00016654
H  1.319176 -0.03672559 0.0007972
