program: Gaussian 16
title: KOtBu tetramer
version: ES64L-G16RevC.01
method: RM062X
basis: 6-311++G(d,p)
operation: Freq
keyword: #P
keyword: Geom=AllCheck
keyword: Guess=TCheck
keyword: SCRF=Check
keyword: GenChk
keyword: RM062X/6-311++G(d,p)
keyword: Freq
converged: YES YES NO YES
title: Mulliken charges:
elementType: K O O K O O K K C C H H H C H H H C H H H C C H H H C H H H C H H H C C H H H C H H H C H H H C C H H H C H H H C H H H
charge: 0.976758 -0.828392 -0.829305 0.981835 -0.829032 -0.828422 0.980557 0.973568 -0.018032 -0.421204 0.114251 0.146742 0.113229 -0.416072 0.148357 0.112858 0.112325 -0.416873 0.113568 0.147985 0.112625 -0.021794 -0.415668 0.112703 0.113396 0.148640 -0.418224 0.114335 0.147333 0.113106 -0.417158 0.147768 0.112733 0.114306 -0.021965 -0.412328 0.113063 0.149805 0.111006 -0.417337 0.113218 0.113712 0.147606 -0.421508 0.114204 0.115570 0.145957 -0.018302 -0.421202 0.146525 0.112812 0.115211 -0.418364 0.114622 0.147704 0.112310 -0.414700 0.111143 0.113370 0.149068
chargesum: -0.00000
title: Mulliken charges with hydrogens summed into heavy atoms:
elementType: K O O K O O K K C C C C C C C C C C C C C C C C
charge: 0.976758 -0.828392 -0.829305 0.981835 -0.829032 -0.828422 0.980557 0.973568 -0.018032 -0.046982 -0.042532 -0.042694 -0.021794 -0.040929 -0.043451 -0.042351 -0.021965 -0.038455 -0.042802 -0.045778 -0.018302 -0.046654 -0.043728 -0.041118
chargesum: 0.00000
polarizability: 3.12901484e+02 1.07835232e-01 3.13119548e+02 -9.76292322e-02 4.95516221e-02 3.13046085e+02
1716.lowfreq: -4.1927 -2.8593 -0.0015 0.0012 0.0026 6.6490 15.3275 17.8005 22.6095
frequency: 15.1920 17.6065 22.4056 25.3945 25.8612 27.5055 29.9139 31.8468 33.0776 50.4797 51.2263 54.4668 68.5973 70.4172 70.8418 93.0411 94.3450 104.0493 160.8591 161.3612 162.5933 163.5654 165.0443 171.4569 171.6425 173.3878 176.6646 186.5642 187.1155 188.4403 251.7141 254.6492 255.5616 261.0860 310.9229 312.6299 313.2841 313.4707 316.1324 317.3277 317.4916 321.0812 352.3970 353.2403 353.9412 354.1895 354.6641 356.6642 357.0022 357.2676 437.0240 437.2875 437.6568 438.9202 487.3166 487.4724 488.5871 488.8820 489.0597 492.3422 492.5686 492.8556 757.1700 757.6142 757.8428 757.9212 886.0209 886.4130 886.7359 886.8289 887.0361 887.2168 887.2862 887.4910 932.1083 932.6327 932.7681 933.2498 1010.5169 1010.6387 1010.8251 1014.2576 1028.4577 1028.5152 1028.6217 1028.7146 1029.1458 1029.4572 1029.5355 1029.8231 1239.3206 1239.8651 1240.0385 1240.1030 1240.3741 1240.6818 1240.8913 1240.9634 1249.7016 1249.7623 1249.9541 1264.4358 1368.3023 1368.4916 1368.7919 1369.1100 1369.3062 1369.4625 1369.7066 1370.0704 1390.5804 1390.8601 1391.0071 1391.5728 1472.8917 1473.2207 1473.5772 1473.9919 1481.1063 1481.4329 1481.7714 1482.0370 1482.1724 1482.4945 1483.0378 1483.3865 1493.4600 1494.1933 1494.3544 1494.6855 1494.7867 1495.0799 1495.1724 1495.2433 1509.5321 1509.6075 1509.9443 1510.8075 3023.1570 3023.6239 3023.9948 3024.0985 3024.1372 3024.2788 3024.5682 3024.8478 3032.6191 3032.8034 3033.3429 3033.4920 3095.5515 3095.8312 3096.5666 3097.1663 3099.4384 3099.5770 3100.1117 3100.3932 3100.4275 3100.6389 3100.7014 3100.8189 3102.8991 3103.0113 3103.0568 3103.2159 3103.4934 3103.5635 3103.8176 3104.0680 3111.1817 3111.4850 3111.6773 3112.1789
redmass: 3.5217 3.5184 2.8706 2.9851 2.8663 2.9845 3.3348 3.3293 3.3969 5.0573 5.0393 5.1981 7.8966 7.9130 7.8886 7.2047 7.2211 5.6438 7.9691 7.9107 7.8962 8.5001 8.4340 11.0123 11.3047 11.3538 17.6701 6.3644 6.3460 6.4130 1.0123 1.0119 1.0101 1.0097 1.0554 1.0527 1.0496 1.0488 1.0576 1.0558 1.0545 1.0624 2.3776 2.3197 2.3441 2.3398 2.3292 2.3704 2.3710 2.3654 2.2102 2.2093 2.2117 2.2233 3.0559 3.0423 3.0751 3.0589 3.0699 3.1571 3.1527 3.1624 3.3462 3.3500 3.3535 3.3503 1.6705 1.6689 1.6650 1.6678 1.6689 1.6679 1.6650 1.6694 1.1972 1.1974 1.1979 1.1971 2.3148 2.3167 2.3172 2.2552 1.3948 1.3934 1.3938 1.3945 1.3917 1.3914 1.3914 1.3916 2.7197 2.7130 2.7220 2.7183 2.7114 2.7179 2.7158 2.7178 3.7614 3.7606 3.7554 3.9318 1.3300 1.3315 1.3322 1.3322 1.3301 1.3297 1.3301 1.3303 1.2535 1.2529 1.2529 1.2544 1.0504 1.0505 1.0503 1.0504 1.0469 1.0464 1.0464 1.0465 1.0465 1.0464 1.0463 1.0463 1.0607 1.0609 1.0610 1.0611 1.0612 1.0607 1.0605 1.0609 1.0544 1.0543 1.0543 1.0543 1.0339 1.0339 1.0339 1.0339 1.0339 1.0338 1.0338 1.0338 1.0349 1.0349 1.0349 1.0348 1.1040 1.1040 1.1039 1.1039 1.1019 1.1019 1.1019 1.1018 1.1019 1.1019 1.1019 1.1019 1.1022 1.1022 1.1022 1.1022 1.1022 1.1021 1.1022 1.1022 1.1009 1.1009 1.1009 1.1007
irintensity: 0.0023 0.0069 0.0062 0.0020 0.0007 0.0024 0.0006 0.0065 0.0077 0.0270 0.0015 0.0145 1.0472 0.9179 1.1045 0.0199 0.0125 0.0181 0.0805 0.6790 0.0688 0.3619 0.2035 27.6971 39.7554 34.3096 0.8196 98.5938 103.0395 110.4832 0.2573 0.2281 0.0186 0.0379 0.0884 0.1045 0.0208 0.0701 0.1703 0.0586 0.0645 0.0693 2.2264 0.0793 0.2144 0.2132 0.9625 24.6867 25.5509 24.8757 16.9951 18.0787 16.8245 0.8249 2.7111 2.6759 0.6978 0.2195 0.7996 68.5074 67.9845 67.9903 1.8538 2.0015 2.2349 0.7207 1.5153 1.7281 1.2570 1.6890 1.5292 1.9756 1.6518 1.7412 0.0043 0.0105 0.0007 0.0011 134.1769 137.0100 134.3736 0.2318 0.2294 0.1169 0.8601 1.7284 0.5014 0.7162 1.1827 1.1237 10.2243 8.8157 11.4136 10.7351 16.6423 35.5540 46.9803 57.8918 303.5632 309.7529 308.4690 0.0039 4.5057 4.9535 66.7217 23.4702 10.0139 16.6653 66.4096 55.4110 14.5783 14.7447 15.0538 1.0380 0.0004 0.0031 0.0054 0.0007 0.4767 0.4901 0.5421 3.3402 0.8591 0.8780 3.4762 3.1563 3.8074 2.2502 3.2527 7.1142 2.9363 5.4982 4.9343 10.2970 4.8058 4.5221 3.1809 2.1110 56.4716 56.3910 32.3445 63.5842 69.0445 67.2619 72.3359 71.2275 2.0849 2.9990 2.7584 3.9699 2.4288 1.6206 0.5204 1.9610 86.0760 25.4998 37.4656 53.2382 31.7828 30.4558 11.4593 21.5294 2.6281 20.0517 43.1329 44.8917 48.2990 14.2847 82.9321 54.7030 204.4288 221.6589 216.2944 26.3501
temp: 403.150 k
press: 1.00000 atm
elementType: 19 8 8 19 8 8 19 19 6 6 1 1 1 6 1 1 1 6 1 1 1 6 6 1 1 1 6 1 1 1 6 1 1 1 6 6 1 1 1 6 1 1 1 6 1 1 1 6 6 1 1 1 6 1 1 1 6 1 1 1
symmnumber: 1
zpe: 1310698.5 jmol-1
zpe.correction: 0.499219 hartree
zpe.thermalcorrener: 0.561502 hartree
zpe.thermalcorrenthalpy: 0.562778 hartree
zpe.thermalcorrgfe: 0.378633 hartree
zpe.sumelectzpe: -3331.634305 hartree
zpe.sumelectthermal: -3331.572022 hartree
zpe.sumelectthermalent: -3331.570746 hartree
zpe.sumelectthermalfe: -3331.754891 hartree
dipole: -0.0021 -0.0030 0.0081
dipole: 0.0089
quadrupole: -184.5284 -184.6121 -184.5930
quadrupole: -0.0085 -0.0173 -0.0464
quadrupole: 0.0494 -0.0342 -0.0152 -0.0085 -0.0173 -0.0464
hfenergy: -3332.133524 hartree
pointgroup: C01 [X(C16H36K4O4)]
dipole: -0.0008306 -0.0011863 0.0031802 debye
polarizability: 312.9014844|0.1078352|313.1195481|-0.0976292|0.0495516|313.0460847 unknown
InChI: InChI=1/4C4H9O.4K/c4*1-4(2,3)5;;;;/h4*1-3H3;;;;/rC16H36K4O4/c1-13(2,3)21-17-18(21)19(17,21)20(17,18,22(17,18)14(4,5)6,23(17,19)15(7,8)9)24(18,19)16(10,11)12/h1-12H3
charge 0 multiplicity 1
60 atoms
K  -3.5801414 -0.57377951 -0.20468286
O  -3.26257816 1.71840344 0.93437888
O  -2.26777565 0.25820636 -2.26758161
K  -1.94713901 2.54770573 -1.12353723
O  0.25407089 1.71512606 -0.06359838
O  -1.38425048 -1.41768517 0.85692822
K  -0.07107426 -0.57479732 -1.20007736
K  -1.06315281 0.87363441 1.99151781
C  -2.64245606 0.05595797 -3.58141145
C  -2.84935044 1.40427116 -4.30002314
H  -1.91783725 1.97990545 -4.27534603
H  -3.14859723 1.28504938 -5.3462748
H  -3.62750365 1.97887122 -3.78614653
C  -3.96133353 -0.73942598 -3.65229947
H  -4.29174618 -0.9216232 -4.67989888
H  -3.83207973 -1.70873373 -3.15879711
H  -4.75161245 -0.18658405 -3.1330499
C  -1.55740777 -0.73545818 -4.33874915
H  -1.40609535 -1.70653028 -3.8551122
H  -1.81724383 -0.91407395 -5.38704707
H  -0.61291231 -0.18148401 -4.31118245
C  -1.22044058 -2.64680348 1.46505959
C  -2.53173849 -3.45631473 1.41322231
H  -3.3253106 -2.90348021 1.92753267
H  -2.83029549 -3.60513797 0.36984075
H  -2.44136866 -4.43982866 1.8853017
C  -0.12008156 -3.46015815 0.75470851
H  0.82588727 -2.90935089 0.79292526
H  0.03948202 -4.44367069 1.20816778
H  -0.39434817 -3.60912946 -0.29526376
C  -0.81706425 -2.47076983 2.94273891
H  -0.67898291 -3.42517839 3.46082515
H  0.1226904 -1.91118724 3.0028145
H  -1.59318028 -1.90565259 3.47012919
C  -4.23769737 2.41614214 1.61972203
C  -3.81680563 2.63759941 3.08656318
H  -2.87712623 3.19964757 3.11812756
H  -4.56470954 3.19205025 3.66232709
H  -3.66116676 1.66940291 3.57491964
C  -5.56889964 1.63824543 1.61040755
H  -5.89639532 1.48239698 0.57691809
H  -5.42538371 0.65986385 2.0815997
H  -6.36818077 2.16038164 2.14603922
C  -4.47522077 3.79397319 0.97029481
H  -3.54326398 4.36934484 0.98026462
H  -4.79016447 3.65993586 -0.07007974
H  -5.24297337 4.37905606 1.48667924
C  1.43196186 2.43350222 -0.00393711
C  2.55618374 1.69391488 -0.75617636
H  3.5076956 2.23480479 -0.73450979
H  2.71380115 0.70864414 -0.30438789
H  2.26603094 1.55421741 -1.8030075
C  1.25181266 3.82421604 -0.64487976
H  0.46373096 4.37189343 -0.11687118
H  2.16528821 4.42664066 -0.61344623
H  0.95470193 3.71046955 -1.69300028
C  1.87456019 2.62858919 1.46020274
H  1.09820388 3.17173076 2.01002874
H  2.01799233 1.65113306 1.93330227
H  2.80979009 3.19058224 1.54876453
