program: Gaussian 09
title: 000004551
version: EM64L-G09RevD.01
frameworkgroup: C1[X(C9H5BrN2O3)]
method: RPBEPBE
basis: SDD
operation: Freq
keyword: #p
keyword: freq=noraman
keyword: PBEPBE/SDD
title: #p freq=noraman PBEPBE/SDD
converged: NO YES NO NO
title: Mulliken charges:
elementType: Br O O O N N C C C C C C C C C H H H H H
charge: 0.037765 -0.246237 -0.215818 -0.200206 -0.361913 -0.011526 0.346947 0.227510 0.168507 -0.373623 -0.255625 0.252143 -0.326463 -0.234244 -0.175763 0.272168 0.254541 0.313652 0.267717 0.260468
chargesum: 0.00000
title: Mulliken charges with hydrogens summed into heavy atoms:
elementType: Br O O O N N C C C C C C C C C
charge: 0.037765 -0.246237 -0.215818 -0.200206 -0.361913 -0.011526 0.346947 0.227510 0.168507 0.153086 0.058027 0.252143 -0.058746 -0.234244 0.084705
polarizability: 2.02032622e+02 -7.12245754e+00 1.43596249e+02 -2.75528379e+00 -5.53991265e-01 5.52937352e+01
1716.lowfreq: -7.9423 -3.5178 -1.1657 0.0003 0.0006 0.0006 57.4869 91.5790 112.1246
frequency: 57.4655 91.5765 112.1233 131.8940 182.8517 240.3420 255.5978 263.9896 323.7272 345.9238 383.1344 425.6172 449.9617 496.6220 552.4697 565.1243 592.9360 597.4808 662.7220 682.8557 697.4013 718.1441 752.7975 765.6959 788.5893 821.5192 901.0224 922.1650 949.0448 952.5096 1001.0764 1044.3971 1053.7824 1071.5267 1133.6180 1193.2473 1205.2388 1267.2358 1298.2653 1346.5161 1372.3693 1380.9836 1441.5239 1458.9827 1478.1345 1535.0708 1582.0735 1607.3210 1727.3511 2989.3038 3131.9217 3168.2422 3184.7226 3187.2251
redmass: 9.0035 6.0802 16.1140 8.6545 3.8085 11.1561 6.2153 10.2910 5.6849 5.7291 7.1126 7.6827 3.6658 7.4695 6.3892 5.2818 6.4825 7.0564 9.3821 7.7231 9.0645 4.5952 10.8337 10.0822 5.8584 1.4544 1.3949 9.5907 3.8435 1.6625 2.0418 5.7380 5.1690 2.2111 1.6146 2.8269 1.1341 1.3081 4.1980 1.3312 10.0225 4.6692 2.8368 1.2865 3.8910 8.6089 8.6410 7.6600 12.7179 1.0686 1.0962 1.0889 1.0939 1.0972
irintensity: 1.8179 1.0291 1.0841 1.5396 9.3523 2.8069 1.4399 0.2691 4.7648 2.2946 2.0530 1.6568 8.0735 5.6293 23.1553 9.5574 3.7324 10.2810 17.1056 9.5175 4.6501 0.4712 21.9439 29.5949 6.3773 44.5617 21.4260 2.7421 40.5677 13.3500 11.5952 81.2922 52.7414 8.9030 31.6372 76.6961 9.3684 11.6103 34.1488 9.1033 11.9723 75.1216 22.2542 23.6424 224.0440 110.4786 6.1362 14.1527 380.1655 32.2646 1.3780 0.7667 2.8039 4.1477
temp: 298.150 k
press: 1.00000 atm
elementType: 35 8 8 8 7 7 6 6 6 6 6 6 6 6 6 1 1 1 1 1
symmnumber: 1
zpe: 338204.8 jmol-1
zpe.correction: 0.128815 hartree
zpe.thermalcorrener: 0.140449 hartree
zpe.thermalcorrenthalpy: 0.141393 hartree
zpe.thermalcorrgfe: 0.089736 hartree
zpe.sumelectzpe: -693.496250 hartree
zpe.sumelectthermal: -693.484616 hartree
zpe.sumelectthermalent: -693.483672 hartree
zpe.sumelectthermalfe: -693.535330 hartree
dipole: 0.6206 5.2340 1.4079
dipole: 5.4555
quadrupole: -101.8689 -99.3569 -94.7325
quadrupole: -9.4939 -4.0439 0.4724
quadrupole: -3.2161 -0.7041 3.9202 -9.4939 -4.0439 0.4724
hfenergy: -693.6250652 hartree
pointgroup: C01 [X(C9H5Br1N2O3)]
dipole: -0.8032714 -1.9166169 0.5368472 debye
dipolederiv: -0.4115884 0.2853335 0.0391588 0.357897 -0.3171804 -0.0417375 0.0518759 -0.0451743 -0.0189762 -1.1056795 0.4452094 -0.0221958 0.4740833 -0.6106364 0.0570796 0.1159276 -0.0869904 -0.277508 -0.5178814 0.5156388 -0.0483373 -0.1140623 -0.5263566 0.0561408 0.0232337 -0.0062531 -0.1624945 -0.4373101 0.3373014 -0.0344855 -0.0980197 -1.1549199 0.08624 0.014137 0.0643338 -0.3201416 -1.1779966 -0.2772618 0.067789 0.0076502 -0.8952031 0.0798873 0.0618251 0.114683 -0.0414839 -0.474311 -0.1054946 0.0142794 0.113996 0.1602255 -0.0439976 0.0101536 -0.0209625 -0.155232 0.8615129 0.1925891 -0.0417941 0.3388661 0.0345643 0.0178267 0.0109696 -0.0390551 0.0482981 0.6993969 -0.127365 -0.0405816 -0.4907283 0.2552343 -0.0290965 -0.0932536 -0.0507206 0.0644512 0.5929261 -0.4723668 -0.0769878 -0.7283257 0.461682 -0.0070035 -0.2206324 0.0872383 0.0440152 0.7087994 -0.138743 0.1081361 0.0910326 0.212548 -0.054494 0.2004938 -0.0374835 0.4051765 -0.3099049 0.1351456 0.0282468 0.1921148 -0.1535088 -0.0149976 0.0259663 -0.0292116 -0.0717989 0.9246734 -0.4314182 0.0181742 0.4077702 1.8135028 -0.1658068 -0.0308296 -0.1035944 0.334941 -0.083455 0.1423158 0.0113046 0.0680172 0.0188493 0.0373168 0.0155168 0.0640058 -0.1364524 0.6962442 -0.6163679 -0.0867733 -0.7564206 0.5458472 0.1014517 -0.1057072 0.0998365 -0.1363258 -0.1731602 0.1443041 0.0246648 0.2060465 -0.1336517 -0.0089023 0.0294787 -0.0118106 -0.0874434 0.0015132 0.074693 0.0090346 0.031404 0.074039 -0.0219357 0.0257883 -0.0420944 0.1002696 -0.0034925 -0.040983 0.0387199 -0.0675858 0.0608712 0.0019428 -0.101246 0.0799057 -0.0971554 0.1561961 -0.032677 -0.0054545 0.0046705 0.0756642 -0.015554 -0.0200651 -0.0061045 0.1747357 0.0835171 0.0030531 0.0018284 -0.0137415 -0.0241639 -0.026662 -0.0055317 -0.0199232 0.1707345 -0.0299997 -0.0329065 -0.0047266 -0.0246644 0.102593 -0.0076983 -0.0081008 -0.0106249 0.1623902 unknown
polarizability: 193.2540779|-21.9637165|152.2678576|-3.4826659|3.2229592|55.4006705 unknown
InChI: InChI=1S/C9H5BrN2O3/c10-5-1-2-7-6(3-5)12-8(4-14-7)11-15-9(12)13/h1-3H,4H2
charge 0 multiplicity 1
20 atoms
Br -4.058383 1.973537 0.302563
O  0.284895 -2.366633 -0.354971
O  3.109959 1.21664 -0.196366
O  1.245262 2.694665 -0.235819
N  1.065898 0.300473 0.013005
N  3.276792 -0.261991 -0.055943
C  -0.329814 0.005214 0.027237
C  2.027692 -0.704949 0.067523
C  -0.689728 -1.3611 -0.148058
C  1.584894 -2.117737 0.316899
C  -1.319904 1.0014 0.162933
C  1.713232 1.55232 -0.149406
C  -2.046086 -1.727386 -0.198602
C  -2.671083 0.607289 0.113959
C  -3.048265 -0.740835 -0.06906
H  2.295265 -2.84142 -0.105747
H  1.46815 -2.298266 1.404248
H  -1.031144 2.04838 0.281059
H  -2.305949 -2.779217 -0.344997
H  -4.103383 -1.022983 -0.107456
