program: Gaussian 16
title: KOtBu tetramer after C-H abs - scan for Me radical loss - 12 as ts - ircf - scan for Me rad CH abs - 34 as ts - irc fwd
version: ES64L-G16RevC.01
method: UM062X
basis: 6-311++G(d,p)
operation: Freq
keyword: #P
keyword: Geom=AllCheck
keyword: Guess=TCheck
keyword: SCRF=Check
keyword: GenChk
keyword: UM062X/6-311++G(d,p)
keyword: Freq
title: KOtBu tetramer after C-H abs - scan for Me radical loss - 12 as ts - i
converged: YES YES NO NO
polarizability: 3.23087775e+02 1.09953075e+01 3.12633441e+02 1.46946012e+01 4.64920696e+00 3.42684736e+02
1716.lowfreq: -4.4143 -0.0023 -0.0013 -0.0011 2.5176 6.1586 15.7995 22.7884 29.9154
frequency: 15.4301 22.7512 29.8106 30.5420 35.8284 41.9962 46.9740 47.2381 52.3466 52.8251 66.0986 68.7987 70.8628 75.4696 80.9592 84.6352 90.1329 103.8055 107.6743 108.5675 116.4948 118.9846 163.1093 165.1317 166.1185 167.9958 173.3283 174.5915 176.2549 178.8433 181.6704 185.6617 188.9111 197.7797 214.4911 219.9293 254.1803 258.2161 258.9241 305.3796 312.8895 314.7730 321.3693 322.9133 326.5301 353.8397 354.2765 356.1953 356.9863 358.0511 359.6684 437.2964 438.7463 439.3194 451.9336 460.0091 487.5773 488.1178 488.4071 490.5185 491.5504 492.0493 526.2196 597.5617 645.0777 705.6851 757.3368 757.4653 758.2550 771.5324 886.6138 886.9246 887.4579 887.9652 888.1867 888.3202 932.9567 933.2139 934.0823 934.8718 975.0541 1008.4089 1009.4579 1011.9186 1028.2631 1028.5964 1029.1998 1029.8305 1030.0774 1030.4981 1038.2703 1168.5747 1239.7103 1240.3855 1241.0165 1241.2011 1241.8555 1242.0837 1248.8106 1249.2683 1259.5120 1328.3955 1340.2378 1361.4488 1368.9403 1369.6937 1370.5097 1370.7380 1371.2375 1373.1457 1391.8037 1392.8910 1393.7213 1428.9349 1448.5971 1473.8289 1474.2364 1474.3043 1481.5285 1481.8938 1483.1011 1483.5526 1483.8788 1484.4836 1494.6379 1494.7242 1494.8921 1496.0554 1496.3516 1496.7526 1510.4159 1510.8326 1511.2429 1515.4626 1564.1697 1571.1315 3021.7508 3023.6705 3024.3327 3024.9433 3025.1220 3027.1103 3033.2396 3033.5242 3035.3619 3038.0306 3093.0640 3095.6887 3096.3686 3098.8848 3099.5710 3099.9845 3100.8895 3101.3717 3102.6296 3103.0299 3103.8864 3104.3086 3105.0129 3106.3816 3110.0715 3112.0418 3112.5191 3115.2998 3147.9055 3149.4896 3159.5270 3168.2668 3170.1390 3257.4765 3279.2952
redmass: 3.5885 3.4582 3.2375 2.8057 3.6997 2.9227 3.2836 3.4483 4.4203 3.1963 6.0451 5.3251 5.7283 6.6639 6.0904 1.4573 2.6259 4.7523 5.6392 3.9547 3.6286 4.9164 5.9251 6.8494 7.5888 5.9722 9.3009 10.0128 7.8939 8.3674 9.9704 1.5389 6.1080 5.0818 1.3552 3.8822 1.0268 1.0124 1.0117 1.0406 1.0468 1.0505 1.0594 1.0661 1.0620 2.3627 2.4280 2.3003 2.4237 2.3188 2.3037 2.2072 2.2057 2.2161 2.1688 1.0956 3.0496 3.0588 3.0611 3.1138 3.1252 3.1517 3.3266 1.3562 1.1666 1.6874 3.3676 3.3638 3.3529 1.8509 1.6677 1.6650 1.6653 1.6668 1.6629 1.6669 1.1976 1.1971 1.1952 1.9523 2.2170 2.3321 2.3251 2.2847 1.3962 1.3983 1.3937 1.3901 1.3911 1.3914 2.0543 3.2281 2.6994 2.7048 2.7292 2.7281 2.7386 2.7204 3.6659 3.7070 3.8080 1.1790 1.1783 1.1860 1.3321 1.3252 1.3298 1.3278 1.3282 1.3066 1.2535 1.2529 1.2516 1.9577 1.2174 1.0504 1.0503 1.0503 1.0466 1.0466 1.0467 1.0464 1.0465 1.0464 1.0609 1.0609 1.0609 1.0607 1.0605 1.0628 1.0543 1.0576 1.0579 2.0309 1.0257 1.0091 1.0347 1.0341 1.0340 1.0341 1.0339 1.0346 1.0351 1.0349 1.0331 1.0104 1.1031 1.1035 1.1036 1.1012 1.1016 1.1018 1.1018 1.1020 1.1019 1.1022 1.1021 1.1021 1.1021 1.1020 1.1012 1.1009 1.1007 1.1013 1.0563 1.1013 1.1009 1.1009 1.0528 1.1150 1.1189
irintensity: 0.0049 0.0269 0.0347 0.0040 0.0128 0.0055 0.0026 0.0399 0.0267 0.1013 0.7684 0.8909 0.2579 0.8203 1.4142 0.0472 0.0703 0.9773 0.0908 0.5488 1.1185 1.2420 0.2894 3.9272 0.4326 1.3851 16.4605 31.3244 4.4926 61.6019 24.2405 21.0724 74.9195 108.7802 9.5274 90.3012 0.2958 0.1383 0.0655 0.0493 0.0373 0.0777 0.2885 0.1235 0.1667 1.5357 2.1988 3.0629 26.4331 17.7426 13.6193 15.6212 13.9330 10.0162 6.5413 2.5395 3.4760 4.4468 1.4689 33.5319 47.6962 69.3192 1.5382 18.1083 48.8586 2.8898 2.5929 1.5203 2.0101 100.6408 1.4729 1.3914 1.5114 1.4073 1.4412 1.7907 0.1870 0.0098 0.0062 51.3611 5.1386 128.8566 120.9654 55.5769 0.7650 1.2185 0.6212 0.6323 1.0410 1.0861 116.5359 174.5153 6.9394 41.1879 10.5827 31.8842 20.0186 46.9147 255.0677 313.9179 122.1472 16.0180 33.0291 26.2764 17.8690 27.1882 30.1927 35.7798 36.4882 23.4183 14.1129 17.7280 10.3462 241.1116 14.4665 0.0045 0.0391 0.0557 0.8694 1.0974 1.1315 0.4155 1.2329 3.0716 2.3377 2.1145 6.9512 4.8279 6.1317 10.2854 4.1736 1.5646 4.6906 307.3174 4.7620 0.0639 47.4317 54.1728 57.4513 45.0391 87.0659 62.9053 3.3110 2.7743 6.8100 9.9995 24.7628 7.0685 0.3494 53.0567 40.4463 50.8915 66.8362 30.5891 15.2910 6.8232 24.8292 22.0562 54.5929 32.4986 82.1127 199.4968 118.7256 116.8975 5.2990 6.4842 14.0046 2.6653 32.8509 7.1612 12.9393
temp: 403.150 k
press: 1.00000 atm
elementType: 8 8 8 8 6 6 1 1 1 6 1 1 1 6 1 1 1 6 6 1 1 1 6 1 1 1 6 1 1 1 6 6 1 1 1 6 1 1 1 6 1 1 1 6 6 1 1 1 6 1 1 6 1 1 1 19 19 19 19
symmnumber: 1
zpe: 1264700.7 jmol-1
zpe.correction: 0.481699 hartree
zpe.thermalcorrener: 0.546300 hartree
zpe.thermalcorrenthalpy: 0.547577 hartree
zpe.thermalcorrgfe: 0.359766 hartree
zpe.sumelectzpe: -3330.991930 hartree
zpe.sumelectthermal: -3330.927328 hartree
zpe.sumelectthermalent: -3330.926052 hartree
zpe.sumelectthermalfe: -3331.113863 hartree
dipole: -1.0006 -0.6783 0.8324
dipole: 1.4677
quadrupole: -184.6699 -185.4307 -183.1266
quadrupole: -2.7281 4.0247 2.6674
quadrupole: -0.2609 -1.0216 1.2825 -2.7281 4.0247 2.6674
hfenergy: -3331.4736288 hartree
pointgroup: C01 [X(C16H35K4O4)]
dipole: -0.3936641 -0.2668559 0.3275063 debye
polarizability: 323.0877747|10.9953075|312.6334407|14.6946012|4.649207|342.6847361 unknown
InChI: InChI=1/3C4H9O.C3H4O.CH4.4K/c3*1-4(2,3)5;1-3(2)4;;;;;/h3*1-3H3;1-2H2;1H4;;;;/rC15H31K4O4.CH4/c1-12(2,3)20-16-19(20)17(20)18(19,15(10,11)21(16,17)18,22(16,19)13(4,5)6)23(17,19)14(7,8)9;/h10-11H2,1-9H3;1H4
charge 0 multiplicity 2
59 atoms
O  -1.63482625 1.02990924 1.20820647
O  -0.42893009 0.01826915 -2.10250549
O  1.7629769 1.55930525 0.25250576
O  0.60548591 -1.86041457 0.88227788
C  -0.7311723 -0.10267788 -3.44625564
C  -1.07999044 1.2731639 -4.04884888
H  -0.23431222 1.95777484 -3.92279121
H  -1.31826211 1.2193738 -5.11584916
H  -1.94833673 1.69236641 -3.5286732
C  -1.93783442 -1.04056365 -3.64774567
H  -2.20900351 -1.16123861 -4.70146861
H  -1.7057637 -2.03033454 -3.23981687
H  -2.80740324 -0.63992339 -3.11560996
C  0.46845075 -0.68375299 -4.22159894
H  0.71584472 -1.67511567 -3.82599119
H  0.26924959 -0.78733361 -5.29289233
H  1.34002961 -0.03169079 -4.0991505
C  0.72225552 -3.12296196 1.43446826
C  -0.61495839 -3.88652874 1.33979444
H  -1.39739231 -3.33002085 1.8682206
H  -0.9071399 -3.9956226 0.28933929
H  -0.55921904 -4.88786946 1.77791758
C  1.79671286 -3.94215916 0.69270525
H  2.7640806 -3.4356254 0.76343885
H  1.90921267 -4.95368891 1.09618333
H  1.52627002 -4.02300453 -0.36539411
C  1.11376562 -3.03046751 2.92303101
H  1.21942087 -4.0133371 3.39322297
H  2.06594068 -2.49991579 3.0244952
H  0.34514933 -2.47376001 3.47057982
C  -2.69366989 1.46463667 1.98251909
C  -2.2803158 1.55756972 3.4649804
H  -1.44261289 2.25514181 3.57065111
H  -3.09425945 1.90361605 4.10980692
H  -1.96201568 0.57150494 3.82117867
C  -3.88173134 0.48794886 1.87314451
H  -4.20518106 0.41689374 0.8290361
H  -3.57206425 -0.50709675 2.21139681
H  -4.7416903 0.79876292 2.47479738
C  -3.16447842 2.85760421 1.52056684
H  -2.336715 3.56988661 1.60205643
H  -3.47905263 2.80910908 0.47258779
H  -4.00349621 3.2389823 2.11127328
C  2.58588675 2.22690127 -0.51716581
C  4.10867172 -0.73241446 1.24334989
H  4.68502901 -1.30378734 0.51373597
H  3.13193862 -1.20131727 1.38313993
H  4.64790484 -0.72655623 2.19065999
C  2.46445598 2.23169439 -1.91027131
H  3.15666848 2.79237459 -2.52476185
H  1.66635984 1.68262961 -2.40253609
C  3.65284996 2.97514625 0.05549643
H  3.7748989 3.00662728 1.13088145
H  3.97451357 0.29182724 0.89199482
H  4.34445848 3.52682623 -0.56725112
K  0.66386295 0.3674603 2.18415128
K  -1.66593935 -1.14810833 -0.17204251
K  -0.55582969 2.23765986 -0.78828283
K  1.82150687 -0.74934646 -1.08300749
