program: Gaussian 16
title: Me-C6H6 radical - TS
version: ES64L-G16RevC.01
method: UM062X
basis: 6-311++G(d,p)
operation: Freq
keyword: #P
keyword: Geom=AllCheck
keyword: Guess=TCheck
keyword: SCRF=Check
keyword: GenChk
keyword: UM062X/6-311++G(d,p)
keyword: Freq
converged: YES YES YES YES
polarizability: 1.30447843e+02 -9.81492623e-03 1.04261386e+02 -1.34466780e+01 -1.19048507e-02 8.45915144e+01
1716.lowfreq: -620.2415 -8.0617 -0.0009 -0.0006 -0.0006 8.5856 16.3677 110.1366 151.9290
frequency: -620.2415 110.1192 151.9144 172.4652 386.2433 415.9703 567.5748 570.7461 612.2061 627.8174 677.2336 724.9588 848.9695 874.8040 900.4366 990.0395 998.9264 1000.2335 1012.6570 1035.5559 1051.1406 1061.6529 1161.0277 1177.5953 1192.2506 1315.9400 1369.9227 1420.4958 1421.3630 1489.5915 1509.8790 1606.6840 1628.5805 3096.4041 3189.0478 3197.5566 3199.3479 3214.2826 3214.8348 3225.2601 3258.0144 3263.0413
redmass: 9.8522 3.3511 1.0315 3.0352 2.7522 2.8425 1.5436 1.1157 5.7268 2.4429 2.1233 1.4000 1.2734 1.2504 1.2935 2.4127 2.1559 1.3608 1.7221 1.7970 1.6623 1.6544 1.1191 1.1562 1.1368 5.0007 1.2499 1.0902 1.0881 1.9062 2.1615 4.9400 5.0889 1.0133 1.0866 1.0880 1.0878 1.0935 1.0956 1.0985 1.1151 1.1158
irintensity: 14.8822 0.0610 0.0140 0.1291 0.5808 0.2576 0.5100 0.5006 0.2699 5.6062 17.2584 136.6093 0.4866 1.2615 9.7080 2.4382 1.3018 0.7996 0.9091 2.9910 4.8761 8.2912 0.6299 0.0011 1.2647 2.9408 0.0027 2.8301 6.2940 14.9998 6.5553 0.5707 4.9973 7.0805 0.2421 5.4534 1.4327 13.0433 26.3614 5.4040 6.4680 5.4593
temp: 403.150 k
press: 1.00000 atm
elementType: 6 6 6 6 6 6 1 1 1 1 1 1 6 1 1 1
symmnumber: 1
zpe: 352556.1 jmol-1
zpe.correction: 0.134282 hartree
zpe.thermalcorrener: 0.146205 hartree
zpe.thermalcorrenthalpy: 0.147482 hartree
zpe.thermalcorrgfe: 0.088491 hartree
zpe.sumelectzpe: -271.872126 hartree
zpe.sumelectthermal: -271.860202 hartree
zpe.sumelectthermalent: -271.858925 hartree
zpe.sumelectthermalfe: -271.917916 hartree
dipole: -0.4820 0.0000 0.0350
dipole: 0.4833
quadrupole: -38.3235 -39.5376 -48.5764
quadrupole: -0.4109 2.4651 0.0240
quadrupole: 3.8223 2.6082 -6.4305 -0.4109 2.4651 0.0240
hfenergy: -272.0064072 hartree
pointgroup: C01 [X(C7H9)]
dipole: -0.1896293 0.0000174 0.0137571 debye
dipolederiv: -0.1518064 0.0063134 0.091236 0.1836676 0.0188043 -0.0366765 0.0281768 -0.0640935 -0.2903183 0.0832644 -0.0173293 0.0036622 -0.0366533 0.0969531 0.0303628 0.0585416 0.0251813 -0.1564717 -0.1147998 0.0001109 0.1686569 0.0000112 -0.1354214 -0.0000072 -0.0217945 0.0000008 -0.1278699 0.0832777 0.0173337 0.0036293 0.0367062 0.0968733 -0.0306786 0.0585088 -0.0254866 -0.1563912 -0.151823 -0.0061829 0.0912574 -0.1836292 0.0189561 0.0362917 0.0284213 0.0636745 -0.2904299 0.3219311 -0.0001071 -0.1399258 -0.0001571 -0.0993753 0.0002015 -0.220937 0.0002196 0.2327375 0.0332434 -0.0716585 -0.0294814 -0.0630242 -0.0507664 -0.0334655 -0.0024262 -0.0066429 0.1536057 0.0410829 0.0774359 -0.0208136 0.088976 -0.0555713 0.0020563 -0.0221249 0.0121452 0.1532619 -0.0845926 -0.000032 -0.0595076 -0.0000265 0.0754256 0.0000498 -0.0485324 0.000049 0.1499602 0.0410713 -0.0774682 -0.020714 -0.0890101 -0.0555758 -0.0017875 -0.0220192 -0.011886 0.1532822 0.0332538 0.071618 -0.029569 0.0630231 -0.050741 0.0337353 -0.0025124 0.0069183 0.1535544 -0.0248806 -0.0000376 -0.0631519 -0.0000407 0.0781703 -0.000008 -0.0650071 -0.0000046 0.0629778 -0.0750728 0.0000279 0.0555493 0.0001093 0.0947655 -0.0001914 0.1574035 -0.0001774 -0.1912461 -0.0056275 0.0390026 0.016186 0.0785601 -0.0371381 -0.0147129 0.0389783 0.028691 0.0655252 -0.0056282 -0.0389671 0.0162494 -0.0785066 -0.0371583 0.0148457 0.0390601 -0.0285766 0.0655491 -0.0228937 -0.0000598 -0.0832633 -0.0000059 0.0417994 -0.0000155 -0.0037367 -0.0000119 0.0222731 unknown
polarizability: 130.4478426|-0.0098149|104.2613857|-13.446678|-0.0119049|84.5915144 unknown
InChI: InChI=1/C6H6.CH3/c1-2-4-6-5-3-1;/h1-6H;1H3
charge 0 multiplicity 2
16 atoms
C  -1.87707368 -0.36141181 -0.31893229
C  -0.53414591 -0.35392026 0.01197032
C  0.14092809 0.8557498 0.20586266
C  -0.53404913 2.06522207 0.01041513
C  -1.87697601 2.07239711 -0.32049974
C  -2.60440064 0.85548663 -0.37444256
H  -2.39548451 -1.29968798 -0.47939658
H  0.00354215 -1.2907687 0.10402061
H  1.19259299 0.8558754 0.46538271
H  0.00371236 3.00214495 0.10127138
H  -2.39530983 3.01050777 -0.48217533
H  -3.59090908 0.85523737 -0.82357195
C  -3.54984188 0.85677602 1.57017625
H  -4.12274673 1.77690969 1.54784637
H  -4.12275511 -0.06338091 1.54904807
H  -2.66450907 0.85717983 2.19473595
